﻿2026-07-31T03:59:58.2808221Z ##[group]Run cargo test --workspace --lib --bins
2026-07-31T03:59:58.2808579Z [36;1mcargo test --workspace --lib --bins[0m
2026-07-31T03:59:58.2813474Z shell: C:\Program Files\PowerShell\7\pwsh.EXE -command ". '{0}'"
2026-07-31T03:59:58.2813774Z ##[endgroup]
2026-07-31T04:00:01.4798531Z    Compiling fastrand v2.4.1
2026-07-31T04:00:01.5441004Z    Compiling bytemuck v1.25.2
2026-07-31T04:00:01.5469720Z    Compiling mock-adapter v0.47.0 (C:\actions-runner\_work\spt-bs-core\spt-bs-core\adapters\mock)
2026-07-31T04:00:01.5470940Z    Compiling spt-proto v0.47.0 (C:\actions-runner\_work\spt-bs-core\spt-bs-core\crates\spt-proto)
2026-07-31T04:00:01.6118953Z    Compiling futures-lite v2.6.1
2026-07-31T04:00:01.6119318Z    Compiling tempfile v3.27.0
2026-07-31T04:00:01.6119564Z    Compiling backon v1.6.0
2026-07-31T04:00:02.0205453Z    Compiling spt-test-support v0.47.0 (C:\actions-runner\_work\spt-bs-core\spt-bs-core\crates\spt-test-support)
2026-07-31T04:00:02.0326033Z    Compiling rgb v0.8.53
2026-07-31T04:00:02.2455301Z    Compiling spt-live v0.47.0 (C:\actions-runner\_work\spt-bs-core\spt-bs-core\crates\spt-live)
2026-07-31T04:00:02.2456432Z    Compiling spt-runtime v0.47.0 (C:\actions-runner\_work\spt-bs-core\spt-bs-core\crates\spt-runtime)
2026-07-31T04:00:02.2478377Z    Compiling spt-store v0.47.0 (C:\actions-runner\_work\spt-bs-core\spt-bs-core\crates\spt-store)
2026-07-31T04:00:02.4129395Z    Compiling spt-msg v0.47.0 (C:\actions-runner\_work\spt-bs-core\spt-bs-core\crates\spt-msg)
2026-07-31T04:00:02.6103367Z    Compiling n0-future v0.3.2
2026-07-31T04:00:02.8143010Z    Compiling n0-watcher v0.6.1
2026-07-31T04:00:02.8145514Z    Compiling iroh-dns v0.98.0
2026-07-31T04:00:02.8600291Z    Compiling avt v0.18.0
2026-07-31T04:00:03.2814587Z    Compiling netwatch v0.16.0
2026-07-31T04:00:03.6562199Z    Compiling iroh-relay v0.98.0
2026-07-31T04:00:04.4597825Z    Compiling spt-term v0.47.0 (C:\actions-runner\_work\spt-bs-core\spt-bs-core\crates\spt-term)
2026-07-31T04:00:04.8560814Z    Compiling portmapper v0.16.0
2026-07-31T04:00:11.2605475Z    Compiling iroh v0.98.2
2026-07-31T04:00:22.4453764Z    Compiling spt-net v0.47.0 (C:\actions-runner\_work\spt-bs-core\spt-bs-core\crates\spt-net)
2026-07-31T04:00:24.2018302Z    Compiling spt-daemon v0.47.0 (C:\actions-runner\_work\spt-bs-core\spt-bs-core\crates\spt-daemon)
2026-07-31T04:00:41.9824797Z    Compiling xtask v0.47.0 (C:\actions-runner\_work\spt-bs-core\spt-bs-core\crates\xtask)
2026-07-31T04:00:41.9825393Z    Compiling spt v0.47.0 (C:\actions-runner\_work\spt-bs-core\spt-bs-core\crates\spt)
2026-07-31T04:00:58.0741483Z     Finished `test` profile [unoptimized + debuginfo] target(s) in 58.04s
2026-07-31T04:00:58.1159887Z      Running unittests src\capture_player.rs (target\debug\deps\capture_player-84a75d77b2d165f9.exe)
2026-07-31T04:00:58.2127513Z 
2026-07-31T04:00:58.2127808Z running 2 tests
2026-07-31T04:00:58.2133147Z test tests::parses_a_well_formed_record ... ok
2026-07-31T04:00:58.2133427Z test tests::refuses_a_length_mismatch ... ok
2026-07-31T04:00:58.2133571Z 
2026-07-31T04:00:58.2133726Z test result: ok. 2 passed; 0 failed; 0 ignored; 0 measured; 0 filtered out; finished in 0.00s
2026-07-31T04:00:58.2133932Z 
2026-07-31T04:00:58.2141593Z      Running unittests src\console_mode_probe.rs (target\debug\deps\console_mode_probe-d91fa02ff96577ea.exe)
2026-07-31T04:00:58.3010458Z 
2026-07-31T04:00:58.3010781Z running 0 tests
2026-07-31T04:00:58.3010930Z 
2026-07-31T04:00:58.3011100Z test result: ok. 0 passed; 0 failed; 0 ignored; 0 measured; 0 filtered out; finished in 0.00s
2026-07-31T04:00:58.3011338Z 
2026-07-31T04:00:58.3022572Z      Running unittests src\main.rs (target\debug\deps\mock_session-913c6f569abb0eba.exe)
2026-07-31T04:00:58.3891937Z 
2026-07-31T04:00:58.3892386Z running 0 tests
2026-07-31T04:00:58.3892569Z 
2026-07-31T04:00:58.3892824Z test result: ok. 0 passed; 0 failed; 0 ignored; 0 measured; 0 filtered out; finished in 0.00s
2026-07-31T04:00:58.3893167Z 
2026-07-31T04:00:58.3905937Z      Running unittests src\shell.rs (target\debug\deps\mock_shell-4153450c5e0c04ba.exe)
2026-07-31T04:00:58.5713119Z 
2026-07-31T04:00:58.5713692Z running 0 tests
2026-07-31T04:00:58.5713856Z 
2026-07-31T04:00:58.5714115Z test result: ok. 0 passed; 0 failed; 0 ignored; 0 measured; 0 filtered out; finished in 0.00s
2026-07-31T04:00:58.5714657Z 
2026-07-31T04:00:58.5732321Z      Running unittests tests\fixtures\gh_fixture.rs (target\debug\deps\gh_fixture-ecc23862a3fbe40c.exe)
2026-07-31T04:00:58.7876093Z 
2026-07-31T04:00:58.7876449Z running 0 tests
2026-07-31T04:00:58.7876627Z 
2026-07-31T04:00:58.7876934Z test result: ok. 0 passed; 0 failed; 0 ignored; 0 measured; 0 filtered out; finished in 0.00s
2026-07-31T04:00:58.7877211Z 
2026-07-31T04:00:58.7889888Z      Running unittests tests\fixtures\git_fixture.rs (target\debug\deps\git_fixture-b85d451740889423.exe)
2026-07-31T04:00:59.0249150Z 
2026-07-31T04:00:59.0249503Z running 0 tests
2026-07-31T04:00:59.0249670Z 
2026-07-31T04:00:59.0249931Z test result: ok. 0 passed; 0 failed; 0 ignored; 0 measured; 0 filtered out; finished in 0.00s
2026-07-31T04:00:59.0250360Z 
2026-07-31T04:00:59.0264789Z      Running unittests tests\fixtures\post_step_fixture.rs (target\debug\deps\post_step_fixture-fbadfeb8eba9ff1b.exe)
2026-07-31T04:00:59.1720417Z 
2026-07-31T04:00:59.1720787Z running 0 tests
2026-07-31T04:00:59.1720933Z 
2026-07-31T04:00:59.1721183Z test result: ok. 0 passed; 0 failed; 0 ignored; 0 measured; 0 filtered out; finished in 0.00s
2026-07-31T04:00:59.1721712Z 
2026-07-31T04:00:59.1736968Z      Running unittests src\main.rs (target\debug\deps\spt-b39679f88e654a40.exe)
2026-07-31T04:01:00.4613645Z 
2026-07-31T04:01:00.4614800Z running 475 tests
2026-07-31T04:01:00.4638850Z test accessview::tests::drill_matches_only_its_own_kind ... ok
2026-07-31T04:01:00.4639470Z test accessview::tests::node_roster_lists_node_scope_entities_and_mode_exceptions ... ok
2026-07-31T04:01:00.4640311Z test accessview::tests::target_roster_groups_types_and_counts_rules ... ok
2026-07-31T04:01:00.4643516Z test api::auth::tests::mints_distinct_nonempty_tokens ... ok
2026-07-31T04:01:00.5407632Z test api::auth::tests::dead_owner_repin_refused_when_sid_owns_another_perch ... ok
2026-07-31T04:01:00.5818971Z test api::auth::tests::dead_owner_repin_still_rescues_a_non_custody_sid ... ok
2026-07-31T04:01:00.5979272Z test api::auth::tests::live_owner_mismatch_still_refuses ... ok
2026-07-31T04:01:00.6214971Z test api::auth::tests::missing_endpoint_is_no_endpoint ... ok
2026-07-31T04:01:00.6216349Z test api::auth::tests::no_proof_is_refused ... ok
2026-07-31T04:01:00.6227222Z test api::delivery::tests::inject_all_pty_falls_back_to_hook ... ok
2026-07-31T04:01:00.6230711Z test api::delivery::tests::inject_resolution_drops_pty_defaults_hook ... ok
2026-07-31T04:01:00.6460497Z test api::auth::tests::worker_missing_is_no_endpoint ... ok
2026-07-31T04:01:00.6470019Z test api::auth::tests::worker_parent_current_sid_authenticates_after_rotation ... ok
2026-07-31T04:01:00.6623595Z test api::auth::tests::token_auth_path_unchanged ... ok
2026-07-31T04:01:00.6769466Z test api::auth::tests::token_proof_authenticates ... ok
2026-07-31T04:01:00.7045263Z test api::auth::tests::pinned_to_dead_sid_mismatched_poll_repins ... ok
2026-07-31T04:01:00.7185195Z test api::auth::tests::session_id_proof_authenticates ... ok
2026-07-31T04:01:00.7391519Z test api::auth::tests::dead_owner_repin_refused_when_sid_is_a_psyche_custody_sid ... ok
2026-07-31T04:01:00.7392643Z test api::engineroom::tests::a_refresh_adopts_only_a_real_divergence ... ok
2026-07-31T04:01:00.7397601Z test api::engineroom::tests::an_admin_code_verifies_across_the_ceremony_window_only ... ok
2026-07-31T04:01:00.7398980Z test api::engineroom::tests::subnet_authority_is_the_empowerment_not_the_gate ... ok
2026-07-31T04:01:00.7400029Z test api::engineroom::tests::the_gate_admits_only_the_reserved_id_provisioned_and_authenticated ... ok
2026-07-31T04:01:00.7401496Z test api::engineroom::tests::the_written_node_mode_is_the_one_the_chain_reads ... ok
2026-07-31T04:01:00.7559375Z test api::auth::tests::worker_stored_sid_authenticates ... ok
2026-07-31T04:01:00.7722103Z test api::auth::tests::worker_wrong_sid_and_token_only_refused ... ok
2026-07-31T04:01:00.7870260Z test api::auth::tests::wrong_token_and_wrong_session_refused ... ok
2026-07-31T04:01:00.8192325Z test api::delivery::tests::an_undated_state_is_dated_by_a_non_edge_report ... ok
2026-07-31T04:01:00.8281539Z test api::delivery::tests::echo_gate_explicit_toggle ... ok
2026-07-31T04:01:00.8521084Z test api::delivery::tests::idle_busy_transitions_manage_sentinels ... ok
2026-07-31T04:01:00.9652327Z test api::delivery::tests::idle_drain_peek_returns_non_deferred_rows_only ... ok
2026-07-31T04:01:00.9657390Z test api::reporting::tests::capability_lists_hostable_types ... ok
2026-07-31T04:01:00.9753906Z test api::delivery::tests::idle_no_gate_does_not_arm_gate ... ok
2026-07-31T04:01:01.0573566Z test api::delivery::tests::only_a_real_state_edge_stamps_the_transition_instant ... ok
2026-07-31T04:01:01.2356586Z test api::delivery::tests::poll_drain_holds_deferred_while_resting_and_releases_once_on_wake ... ok
2026-07-31T04:01:01.2357976Z test api::reporting::tests::endpoint_info_attached_node_from_honest_stamps ... ok
2026-07-31T04:01:01.2358992Z test api::reporting::tests::endpoint_info_attached_node_self_attributes_own_node_driver ... ok
2026-07-31T04:01:01.2361256Z test api::reporting::tests::endpoint_info_json_always_carries_an_activity_word ... ok
2026-07-31T04:01:01.4245267Z test api::delivery::tests::poll_drain_suppresses_idle_only_which_reaches_the_relay ... ok
2026-07-31T04:01:01.4251182Z test api::reporting::tests::env_aliases_resolved_from_manifest ... ok
2026-07-31T04:01:01.6879533Z test api::delivery::tests::poll_drain_validates_notify_copies_against_their_rows ... ok
2026-07-31T04:01:01.6882685Z test api::reporting::tests::filedrops_are_fixed_named_files ... ok
2026-07-31T04:01:01.9110173Z test api::delivery::tests::poll_drains_non_deferred_by_default ... ok
2026-07-31T04:01:02.0636540Z test api::delivery::tests::poll_only_drains_when_hook_method_present ... ok
2026-07-31T04:01:02.2786523Z test api::engineroom::tests::a_non_engine_room_attempt_never_touches_the_empower_ledger ... ok
2026-07-31T04:01:02.4642194Z test api::reporting::tests::boundary_appends_to_the_session_ledger ... ok
2026-07-31T04:01:02.7827530Z test api::reporting::tests::boundary_missing_perch_refused ... ok
2026-07-31T04:01:02.7920532Z test api::reporting::tests::boundary_injects_deferred_shell_context ... ok
2026-07-31T04:01:02.9849067Z test api::reporting::tests::boundary_rebinds_keeping_anchor ... ok
2026-07-31T04:01:03.0076934Z test api::reporting::tests::boundary_refuses_rotating_onto_a_psyche_custody_sid ... ok
2026-07-31T04:01:03.2819337Z test api::reporting::tests::boundary_resurfaces_undismissed_notifs ... ok
2026-07-31T04:01:03.3000122Z test api::startup::tests::a_dead_binder_pid_proves_nothing_and_never_drops_the_stamp ... ok
2026-07-31T04:01:03.3002166Z test api::startup::tests::a_dead_relays_capability_stamp_is_not_resurrected_by_a_listener_rebind ... ok
2026-07-31T04:01:03.3786519Z test api::reporting::tests::boundary_with_a_fresh_sid_is_unaffected_by_the_squat_guard ... ok
2026-07-31T04:01:03.3966427Z test api::reporting::tests::digest_entry_validates_and_appends_to_digest_log ... ok
2026-07-31T04:01:03.4185101Z test api::reporting::tests::driven_by_reads_daemon_marker ... ok
2026-07-31T04:01:03.4489943Z test api::reporting::tests::endpoint_info_activity_word_tracks_the_idle_sentinel ... ok
2026-07-31T04:01:03.4705236Z test api::reporting::tests::endpoint_info_reports_and_refuses ... ok
2026-07-31T04:01:03.5314796Z test api::reporting::tests::erase_unregisters_regardless_of_liveness ... ok
2026-07-31T04:01:03.5463546Z test api::reporting::tests::hint_once_per_session_one_per_message ... ok
2026-07-31T04:01:03.5678314Z test api::reporting::tests::history_log_appends ... ok
2026-07-31T04:01:03.5743364Z test api::reporting::tests::presence_records_endpoint ... ok
2026-07-31T04:01:03.6917530Z test api::reporting::tests::session_end_erase_reaps_stale_worker_then_proceeds ... ok
2026-07-31T04:01:03.7855030Z test api::reporting::tests::session_end_erase_refused_with_live_children ... ok
2026-07-31T04:01:03.8224417Z test api::reporting::tests::session_end_erase_wipes_childless_perch ... ok
2026-07-31T04:01:03.8225788Z test api::startup::tests::fresh_bind_over_dead_life_needs_both_terminal_and_a_new_session ... ok
2026-07-31T04:01:03.8660933Z test api::reporting::tests::session_end_soft_preserves_state ... ok
2026-07-31T04:01:03.9171824Z test api::reporting::tests::soft_end_preserves_a_live_listeners_address ... ok
2026-07-31T04:01:03.9173071Z test api::startup::tests::listen_never_asserts_hosting_topology_and_bind_still_does ... ok
2026-07-31T04:01:03.9174677Z test api::startup::tests::listen_online_gate_refuses_capability_only_online ... ok
2026-07-31T04:01:03.9176399Z test api::startup::tests::listen_orphan_exit_line_names_self_and_parent ... ok
2026-07-31T04:01:03.9796542Z test api::reporting::tests::soft_end_still_cleans_a_dead_listeners_address ... ok
2026-07-31T04:01:04.2424904Z test api::startup::tests::a_listener_over_a_dead_pty_is_not_offlined_by_the_liveness_reconcile ... ok
2026-07-31T04:01:04.3332296Z test api::startup::tests::bind_assigns_home_and_revive_preserves_it ... ok
2026-07-31T04:01:04.3948500Z test api::startup::tests::bind_gateway_earns_no_online_stamp ... ok
2026-07-31T04:01:04.4019668Z test api::startup::tests::parent_watchdog_triggers_exit_on_a_dead_parent_only ... ok
2026-07-31T04:01:05.0416684Z test api::startup::tests::bind_listen_control_detach_keeps_the_earned_hosting_authority ... ok
2026-07-31T04:01:05.0418241Z test api::startup::tests::read_env_measured_capture_replaces_prior_stamp ... ok
2026-07-31T04:01:05.1289322Z test api::startup::tests::bind_live_agent_over_prior_ready_agent_earns_online_on_controllable_with_preserved_type ... ok
2026-07-31T04:01:05.2638082Z test api::startup::tests::bind_records_cwd_so_picker_can_group_by_project ... ok
2026-07-31T04:01:05.2740335Z test api::startup::tests::bind_refuses_a_session_id_that_squats_a_psyche_custody_sid ... ok
2026-07-31T04:01:05.3761220Z test api::startup::tests::bind_with_type_establishes_a_gateway_endpoint ... ok
2026-07-31T04:01:05.3762415Z test api::startup::tests::seed_fail_eof_gives_actionable_stale_broker_hint ... ok
2026-07-31T04:01:05.3763534Z test api::startup::tests::seed_restorable_spends_dead_seeds_restores_recoverable ... ok
2026-07-31T04:01:05.3963178Z test api::startup::tests::bind_with_unrelated_sid_is_unaffected_by_the_squat_guard ... ok
2026-07-31T04:01:05.4008745Z test api::startup::tests::empty_session_seed_refusal_spends_the_seed_no_restore ... ok
2026-07-31T04:01:05.4077595Z test api::startup::tests::empty_session_seed_refused ... ok
2026-07-31T04:01:05.5366576Z test api::startup::tests::establish_stamps_controllable_by_hosting_mode ... ok
2026-07-31T04:01:05.6558446Z test api::startup::tests::fresh_create_over_a_stopped_life_reads_active_with_no_wake ... ok
2026-07-31T04:01:05.7373175Z test api::startup::tests::fresh_create_with_no_prior_carries_no_rest_state ... ok
2026-07-31T04:01:05.7373866Z test api::startup::tests::the_pid_role_is_stamped_from_the_entry_path ... ok
2026-07-31T04:01:05.7594014Z test api::startup::tests::live_perch_under_other_session_conflicts ... ok
2026-07-31T04:01:05.7611286Z test api::tests::adapter_is_optional ... ok
2026-07-31T04:01:05.7644819Z test api::startup::tests::missing_seed_refused ... ok
2026-07-31T04:01:05.7888431Z test api::startup::tests::no_seed_is_the_fallback_trigger_then_sid_binds ... ok
2026-07-31T04:01:05.8624315Z test api::startup::tests::post_spawn_bind_establishes_perch ... ok
2026-07-31T04:01:05.8837094Z test api::startup::tests::prebind_refusal_restores_the_seed_for_retry ... ok
2026-07-31T04:01:05.8846428Z test api::tests::state_value_is_validated ... ok
2026-07-31T04:01:05.8905876Z test api::tests::surface_parses ... ok
2026-07-31T04:01:05.9967826Z test api::startup::tests::rebind_same_session_ok ... ok
2026-07-31T04:01:06.9537848Z test api::startup::tests::revive_preserves_prior_rest_state_and_dormant_anchor ... ok
2026-07-31T04:01:07.0472399Z test api::startup::tests::revive_without_cwd_preserves_prior_cwd ... ok
2026-07-31T04:01:07.0693324Z test api::startup::tests::seed_bind_records_seed_captured_cwd ... ok
2026-07-31T04:01:07.0816563Z test api::startup::tests::session_id_fallback_binds_live_perch_from_sid ... ok
2026-07-31T04:01:07.0935341Z test api::startup::tests::session_id_fallback_refuses_empty_sid_and_dead_anchor ... ok
2026-07-31T04:01:07.0941105Z test api::startup::tests::session_id_fallback_refuses_a_psyche_custody_sid ... ok
2026-07-31T04:01:07.0949325Z test cli::resume_resolution_tests::resume_never_feeds_a_provisional ... ok
2026-07-31T04:01:07.0950881Z test cli::run_home_tests::order_by_mru_orders_guidance ... ok
2026-07-31T04:01:07.0952381Z test cli::run_home_tests::run_home_resolution_matrix ... ok
2026-07-31T04:01:07.0953866Z test cli::run_on_live_tests::run_on_live_never_duplicates_and_create_conflicts ... ok
2026-07-31T04:01:07.0955289Z test cli::run_target_tests::resolve_run_target_quadrants ... ok
2026-07-31T04:01:07.1005462Z test api::startup::tests::stale_seed_refusal_spends_the_seed_no_restore ... ok
2026-07-31T04:01:07.1007355Z test cli::tests::a_status_row_reads_held_over_running_and_carries_its_evidence ... ok
2026-07-31T04:01:07.1086429Z test api::startup::tests::stale_seed_with_dead_anchor_refused ... ok
2026-07-31T04:01:07.1101429Z test cli::tests::access_subcommands_parse ... ok
2026-07-31T04:01:07.1123486Z test cli::tests::adapter_add_transport_flags_parse ... ok
2026-07-31T04:01:07.1409412Z test api::startup::tests::successful_bind_consumes_the_seed_exactly_once ... ok
2026-07-31T04:01:07.1529127Z test cli::tests::a_local_hit_never_asks_the_broker ... ok
2026-07-31T04:01:07.1623453Z test api::startup::tests::valid_seed_binds_live_perch ... ok
2026-07-31T04:01:07.1625076Z test cli::tests::adapter_name_validation_flags_every_unknown ... ok
2026-07-31T04:01:07.1626706Z test cli::tests::adapter_names_comma_list_parses_and_refuses_empties ... ok
2026-07-31T04:01:07.1696407Z test api::tests::ctx_manifest_override_wins_when_manifest_present ... ok
2026-07-31T04:01:07.1786021Z test api::tests::ctx_manifest_unregistered_no_manifest_is_none_not_fatal ... ok
2026-07-31T04:01:07.1793910Z test api::tests::ctx_manifest_resolves_from_registry_when_manifest_absent ... ok
2026-07-31T04:01:07.1820960Z test api::tests::load_manifest_resolves_composite_adapter_option ... ok
2026-07-31T04:01:07.1859378Z test cli::tests::adapter_translate_proof_parses ... ok
2026-07-31T04:01:07.1861810Z test cli::tests::adapter_update_install_dir_is_registered_source_dir_not_repo_name ... ok
2026-07-31T04:01:07.1865426Z test cli::tests::adapter_update_notice_absent_when_no_message ... ok
2026-07-31T04:01:07.1869039Z test cli::tests::adapter_update_notice_renders_declared_message_markdown ... ok
2026-07-31T04:01:07.1870892Z test cli::tests::adapter_update_summary_and_exit_aggregate_isolated_failures ... ok
2026-07-31T04:01:07.1897237Z test cli::tests::adapter_subcommands_parse ... ok
2026-07-31T04:01:07.1912151Z test cli::tests::adapter_version_parses ... ok
2026-07-31T04:01:07.2124095Z test api::worker::tests::cascade_guard_tracks_live_children ... ok
2026-07-31T04:01:07.2126339Z test cli::tests::all_hidden_this_node_suppresses_no_perches_marker ... ok
2026-07-31T04:01:07.2127885Z test cli::tests::already_applied_message_reads_up_to_date_no_restart ... ok
2026-07-31T04:01:07.2685895Z test api::worker::tests::guard_clears_only_when_all_children_stopped ... ok
2026-07-31T04:01:07.2687265Z test cli::tests::any_single_evidence_source_is_enough_and_only_nothing_refuses ... ok
2026-07-31T04:01:07.2715149Z test cli::tests::api_adapter_flag_is_group_level_not_post_subcommand ... ok
2026-07-31T04:01:07.2742079Z test cli::tests::api_listen_accepts_session_id_flag ... ok
2026-07-31T04:01:07.2744112Z test cli::tests::applied_message_appends_restart_required_notice ... ok
2026-07-31T04:01:07.2745568Z test cli::tests::applied_message_renders_semver_or_counter_fallback_and_states_applied ... ok
2026-07-31T04:01:07.4742962Z test api::worker::tests::worker_poll_drains_spool ... ok
2026-07-31T04:01:07.5835480Z test cli::tests::apply_release_crc_swap_only_swaps_changed ... ok
2026-07-31T04:01:07.5869708Z test cli::tests::bare_spt_parses_to_none ... ok
2026-07-31T04:01:07.5870949Z test cli::tests::bare_tty_guard ... ok
2026-07-31T04:01:07.5926500Z test cli::tests::bare_update_parses_composite_flags ... ok
2026-07-31T04:01:07.5928339Z test cli::tests::broker_image_line_reports_without_warning_or_remedy ... ok
2026-07-31T04:01:07.5929633Z test cli::tests::classify_fetch_reject_matrix ... ok
2026-07-31T04:01:07.5930961Z test cli::tests::classify_flat_archive_never_misfires ... ok
2026-07-31T04:01:07.5932539Z test cli::tests::classify_multiplatform_captures_only_known_triples ... ok
2026-07-31T04:01:07.5933938Z test cli::tests::cli_send_stamps_cli_at_node_origin ... ok
2026-07-31T04:01:07.5935389Z test cli::tests::composite_plans_core_first_and_core_only_skips_adapters ... ok
2026-07-31T04:01:07.5937112Z test cli::tests::connection_lines_net_less_hides_stale_heartbeat ... ok
2026-07-31T04:01:07.5939287Z test cli::tests::coordinator_image_line_is_the_only_stale_warning ... ok
2026-07-31T04:01:07.5943310Z test cli::tests::create_existing_name_is_usage_error ... ok
2026-07-31T04:01:07.5949186Z test cli::tests::create_mints_two_distinct_keys_and_records_the_mode ... ok
2026-07-31T04:01:07.5950766Z test cli::tests::create_mode_is_never_preselected ... ok
2026-07-31T04:01:07.5954758Z test cli::tests::create_new_existing_name_is_usage_error ... ok
2026-07-31T04:01:07.6173144Z test cli::tests::create_new_mints_shows_and_requests_save ... ok
2026-07-31T04:01:07.6178366Z test api::worker::tests::worker_poll_holds_deferred_while_resting ... ok
2026-07-31T04:01:07.6179405Z test cli::tests::create_not_elevated_refuses_without_saving ... ok
2026-07-31T04:01:07.6324797Z test cli::tests::create_prints_joining_material_when_elevated ... ok
2026-07-31T04:01:07.6327348Z test cli::tests::cross_node_after_filters_a_sealed_turn_exactly_like_the_local_path ... ok
2026-07-31T04:01:07.6328438Z test cli::tests::daemon_offline_hint_only_when_down ... ok
2026-07-31T04:01:07.6347520Z test cli::tests::daemon_refresh_verb_parses ... ok
2026-07-31T04:01:07.6441744Z test cli::tests::daemon_subcommands_parse ... ok
2026-07-31T04:01:07.6444159Z test cli::tests::daemonless_apply_message_points_at_finish_or_start ... ok
2026-07-31T04:01:07.6445530Z test cli::tests::deferred_elevation_gate_matrix ... ok
2026-07-31T04:01:07.6465690Z test cli::tests::digest_cursor_flags_parse ... ok
2026-07-31T04:01:07.6481374Z test cli::tests::digest_flag_defaults ... ok
2026-07-31T04:01:07.6483184Z test cli::tests::digest_human_path_keeps_the_stderr_trailer ... ok
2026-07-31T04:01:07.6485485Z test cli::tests::digest_json_carries_version_and_leaves_stderr_clean ... ok
2026-07-31T04:01:07.6487841Z test cli::tests::digest_json_predates_path_still_carries_version ... ok
2026-07-31T04:01:07.6488937Z test cli::tests::empty_store_no_flag_guides_to_pair_or_create ... ok
2026-07-31T04:01:07.6597952Z test cli::tests::create_provisions_the_admin_key_and_show_code_never_does ... ok
2026-07-31T04:01:07.6633824Z test cli::tests::endpoint_role_parses ... ok
2026-07-31T04:01:07.6635700Z test cli::tests::endpoint_row_json_endpoint_type_is_additive ... ok
2026-07-31T04:01:07.6656714Z test api::worker::tests::worker_start_mints_id_stores_parent_sid_and_metadata ... ok
2026-07-31T04:01:07.6803792Z test cli::tests::endpoint_subcommands_parse ... ok
2026-07-31T04:01:07.6805071Z test cli::tests::engine_room_ceremony_decision_table ... ok
2026-07-31T04:01:07.6806379Z test cli::tests::engine_room_purge_resets_under_elevation_and_refuses_without_it ... ok
2026-07-31T04:01:07.6807457Z test cli::tests::escalation_choice_parses_fail_closed ... ok
2026-07-31T04:01:07.6894452Z test api::worker::tests::worker_start_nests_under_parent ... ok
2026-07-31T04:01:07.6936511Z test cli::tests::every_read_status_command_emits_valid_json ... ok
2026-07-31T04:01:07.7156685Z test api::worker::tests::worker_start_registration_sid_falls_back_to_presented ... ok
2026-07-31T04:01:07.8401972Z test cli::tests::extract_legacy_flat_stays_flat ... ok
2026-07-31T04:01:07.8403073Z test cli::tests::fetch_reject_action_apply_decision ... ok
2026-07-31T04:01:07.8404601Z test cli::tests::filter_after_excludes_at_or_below_cursor ... ok
2026-07-31T04:01:07.8406765Z test cli::tests::filter_after_predates_window_returns_full ... ok
2026-07-31T04:01:07.8408296Z test cli::tests::finish_message_states_fully_live_no_manual_restart ... ok
2026-07-31T04:01:07.8446930Z test cli::tests::extract_multiplatform_missing_my_triple_is_typed_rejection ... ok
2026-07-31T04:01:07.8448478Z test cli::tests::gh_download_command_no_tag_omits_tag ... ok
2026-07-31T04:01:07.8449591Z test cli::tests::gh_download_command_with_tag_shape ... ok
2026-07-31T04:01:07.8450705Z test cli::tests::gh_failure_classes_render_os_correct_hints ... ok
2026-07-31T04:01:07.8452072Z test cli::tests::gh_release_version_compare_decision ... ok
2026-07-31T04:01:07.8453176Z test cli::tests::gh_version_command_shape ... ok
2026-07-31T04:01:07.8520223Z test cli::tests::grant_subcommands_parse ... ok
2026-07-31T04:01:07.8537083Z test cli::tests::extract_multiplatform_places_shared_root_and_flattens_my_triple ... ok
2026-07-31T04:01:07.8574595Z test cli::tests::help_groups_cover_every_command ... ok
2026-07-31T04:01:07.8619431Z test cli::tests::how_to_topics_cover_ready_and_send ... ok
2026-07-31T04:01:07.8676235Z test cli::tests::hot_path_flat_and_moved_verbs_gone ... ok
2026-07-31T04:01:07.8677480Z test cli::tests::install_platform_check_gates_stamp_and_host_arch ... ok
2026-07-31T04:01:07.8679597Z test cli::tests::instance_rows_palette_and_align ... ok
2026-07-31T04:01:07.8682169Z test cli::tests::instance_rows_project_column ... ok
2026-07-31T04:01:07.8704569Z test cli::tests::invalid_usage_errors ... ok
2026-07-31T04:01:07.8706045Z test cli::tests::join_gate_refuses_without_confirmed_elevation ... ok
2026-07-31T04:01:07.8708419Z test cli::tests::json_activity_key_is_local_only_and_skips_when_unknown ... ok
2026-07-31T04:01:07.8711188Z test cli::tests::install_place_is_idempotent_and_path_block_detected ... ok
2026-07-31T04:01:07.8723272Z test cli::tests::json_activity_words_come_from_the_shared_vocabulary_source ... ok
2026-07-31T04:01:07.8724642Z test cli::tests::json_project_field_skip_if_none ... ok
2026-07-31T04:01:07.8857817Z test cli::tests::multi_subnet_refuses_without_flag_then_resolves_with_it ... ok
2026-07-31T04:01:07.8860123Z test cli::tests::node_group_discards_self_and_skips_empty ... ok
2026-07-31T04:01:07.8862135Z test cli::tests::node_group_freshest_epoch_wins_and_unions_subnets ... ok
2026-07-31T04:01:07.8863784Z test cli::tests::node_group_same_id_two_nodes_two_groups ... ok
2026-07-31T04:01:07.8866034Z test cli::tests::node_grouped_render_structure_and_palette ... ok
2026-07-31T04:01:07.8868901Z test cli::tests::node_level_label_names_an_endpointless_peer ... ok
2026-07-31T04:01:07.8871247Z test cli::tests::node_rows_disambiguate_only_on_label_collision ... ok
2026-07-31T04:01:07.8872959Z test cli::tests::node_status_rows_denominator_counts_routable_only ... ok
2026-07-31T04:01:07.8875744Z test cli::tests::node_status_rows_settle_cheap_signals_probe_only_stale ... ok
2026-07-31T04:01:07.8880761Z test cli::tests::not_elevated_refuses_without_leaking_code_or_saving ... ok
2026-07-31T04:01:07.8887874Z test cli::tests::notify_subnet_resolution_home_default ... ok
2026-07-31T04:01:07.8951873Z test cli::tests::notify_surface_parses ... ok
2026-07-31T04:01:07.8953233Z test cli::tests::origin_asset_urls_latest_and_tag ... ok
2026-07-31T04:01:08.0375154Z test cli::tests::adapter_digest_proof_fills_session_id_key ... ok
2026-07-31T04:01:08.0394945Z test cli::tests::pair_namespace_is_gone ... ok
2026-07-31T04:01:08.0396913Z test cli::tests::peer_health_line_names_the_stage_and_stays_silent_when_idle ... ok
2026-07-31T04:01:08.0397818Z test cli::tests::poll_until_ready_fastpath_timeout_and_later_success ... ok
2026-07-31T04:01:08.0398752Z test cli::tests::post_step_notice_arbitration ... ok
2026-07-31T04:01:08.0419638Z test cli::tests::probe_all_cap_batches_into_windows ... ok
2026-07-31T04:01:08.2432664Z test cli::tests::probe_all_runs_concurrently_in_input_order ... ok
2026-07-31T04:01:08.3114441Z test cli::tests::adapter_digest_proof_gates_on_drops ... ok
2026-07-31T04:01:08.3115842Z test cli::tests::project_index_line_states_health_not_presence ... ok
2026-07-31T04:01:08.3117690Z test cli::tests::prune_candidates_resolve_never_guess ... ok
2026-07-31T04:01:08.3358929Z test cli::tests::adapter_has_live_endpoint_detects_matching_live_perch ... ok
2026-07-31T04:01:08.3871046Z test cli::tests::adapter_has_live_endpoint_false_for_other_or_dead ... ok
2026-07-31T04:01:08.4083733Z test cli::tests::probe_all_timeout_settles_false_without_stalling_batch ... ok
2026-07-31T04:01:08.4154782Z test cli::tests::adapter_profile_verbs_local_only ... ok
2026-07-31T04:01:08.4249913Z test cli::tests::registered_github_home_detects_active_collision ... ok
2026-07-31T04:01:08.4251460Z test cli::tests::remote_cell_project_ref_from_gossiped_recent_projects ... ok
2026-07-31T04:01:08.4422393Z test cli::tests::adapter_string_verbs ... ok
2026-07-31T04:01:08.4423866Z test cli::tests::resolve_transport_auto_follows_probe ... ok
2026-07-31T04:01:08.4425375Z test cli::tests::resolve_transport_explicit_never_probes ... ok
2026-07-31T04:01:08.4426712Z test cli::tests::rest_filter_hides_suspended_shows_all_and_corrupt_always ... ok
2026-07-31T04:01:08.4428210Z test cli::tests::rest_filter_status_first_ordering ... ok
2026-07-31T04:01:08.4430034Z test cli::tests::rest_filter_total_disclosure_and_corrupt_annotation ... ok
2026-07-31T04:01:08.4431344Z test cli::tests::restart_plans_lethal_leg_last ... ok
2026-07-31T04:01:08.4450254Z test cli::tests::ring_timeout_defaults ... ok
2026-07-31T04:01:08.5025308Z test cli::tests::run_bounded_yields_value_or_timeout_default ... ok
2026-07-31T04:01:08.5027007Z test cli::tests::self_pin_annotates_psyche_host_failure ... ok
2026-07-31T04:01:08.5028953Z test cli::tests::self_pin_annotates_translation_fault ... ok
2026-07-31T04:01:08.5030777Z test cli::tests::self_pin_includes_description_when_present ... ok
2026-07-31T04:01:08.5069085Z test cli::tests::send_reply_to_flag_is_removed_and_target_required ... ok
2026-07-31T04:01:08.5094030Z test cli::tests::send_user_msg_flag_parses ... ok
2026-07-31T04:01:08.5111078Z test cli::tests::release_archive_extracts_to_a_registrable_root ... ok
2026-07-31T04:01:13.7470787Z test cli::tests::adapter_translate_proof_gates_on_commit ... ok
2026-07-31T04:01:13.7669721Z test cli::tests::adapter_use_sets_and_clears_pointer ... ok
2026-07-31T04:01:13.7803153Z test cli::tests::adapter_version_surfaces_declared_adapter_version ... ok
2026-07-31T04:01:15.1195123Z test cli::tests::an_engine_room_reset_wipes_records_but_never_deletes_the_engine_room ... ok
2026-07-31T04:01:15.1390306Z test cli::tests::apply_user_msg_gate_local_origination ... ok
2026-07-31T04:01:16.8294541Z test cli::tests::endpoint_role_overwrite_is_the_sole_writer ... ok
2026-07-31T04:01:16.8395416Z test cli::tests::shell_subcommands_parse ... ok
2026-07-31T04:01:16.8504806Z test cli::tests::show_code_prints_reprovisioning_material ... ok
2026-07-31T04:01:16.9293318Z test cli::tests::endpoint_stop_marks_offline ... ok
2026-07-31T04:01:24.6558824Z test cli::tests::json_payload_rides_as_attr_alongside_body ... ok
2026-07-31T04:01:24.6813582Z test cli::tests::fork_forks_homes_and_deletes_exactly_the_source ... ok
2026-07-31T04:01:24.6919942Z test cli::tests::single_subnet_auto_selects_and_code_matches_seed ... ok
2026-07-31T04:01:41.4892327Z test cli::tests::owner_shutdown_gated_by_can_shutdown_grant ... ok
2026-07-31T04:01:41.6711840Z test cli::tests::stage_then_swap_failed_fetch_preserves_install ... ok
2026-07-31T04:01:41.8976103Z test cli::tests::staged_floor_admits_when_core_meets_floor ... ok
2026-07-31T04:01:42.2850855Z test cli::tests::staged_floor_refuses_above_floor_and_leaves_dest_untouched ... ok
2026-07-31T04:01:42.2852241Z test cli::tests::stall_evict_line_surfaces_only_a_real_tally ... ok
2026-07-31T04:01:42.2853795Z test cli::tests::stop_guard_refuses_live_sessions_without_force ... ok
2026-07-31T04:01:42.2951944Z test cli::tests::subcommands_parse ... ok
2026-07-31T04:01:42.3094895Z test cli::tests::subnet_arg_shapes_parse ... ok
2026-07-31T04:01:42.3096366Z test cli::tests::subnet_mode_lines_state_declared_captured_and_pending ... ok
2026-07-31T04:01:42.3101455Z test cli::tests::subnet_status_renders_rows_and_hints_never_secrets ... ok
2026-07-31T04:01:42.3103102Z test cli::tests::subnets_joined_banner_renders_rows_and_divider ... ok
2026-07-31T04:01:42.3104184Z test cli::tests::subprocess_detail_prefers_stderr_then_stdout ... ok
2026-07-31T04:01:42.3489293Z test cli::tests::purge_force_asks_before_it_tears_anything_down ... ok
2026-07-31T04:01:42.3491109Z test cli::tests::this_node_group_merges_roster_with_unbound_truth ... ok
2026-07-31T04:01:42.3492342Z test cli::tests::trust_mutation_gate_refuses_without_confirmed_elevation ... ok
2026-07-31T04:01:42.3496006Z test cli::tests::unknown_elevation_falls_back ... ok
2026-07-31T04:01:42.3499581Z test cli::tests::unknown_named_subnet_is_usage_error ... ok
2026-07-31T04:01:42.3523819Z test cli::tests::update_adapters_verb_parses_with_optional_names ... ok
2026-07-31T04:01:42.3549127Z test cli::tests::update_fetch_apply_flag_parses ... ok
2026-07-31T04:01:42.3605259Z test cli::tests::whoami_parses_as_the_identity_verb ... ok
2026-07-31T04:01:42.3605711Z test elevation::tests::already_elevated_short_circuits_on_every_os ... ok
2026-07-31T04:01:42.3606273Z test elevation::tests::current_returns_a_determinate_level_on_supported_platforms ... ok
2026-07-31T04:01:42.3607023Z test elevation::tests::fallback_message_names_authenticator_app_and_subnet ... ok
2026-07-31T04:01:42.3607552Z test elevation::tests::gate_shows_only_when_confirmed_elevated ... ok
2026-07-31T04:01:42.3608607Z test elevation::tests::launcher_argv_is_absolute_exe_plus_verbatim_args ... ok
2026-07-31T04:01:42.3610377Z test elevation::tests::launchers_never_shell_interpolate_a_crafted_arg ... ok
2026-07-31T04:01:42.3610894Z test elevation::tests::print_hint_floor_uses_absolute_path_each_os ... ok
2026-07-31T04:01:42.3611399Z test elevation::tests::unix_path_order_tty_then_pkexec_then_terminal_then_hint ... ok
2026-07-31T04:01:42.3612090Z test elevation::tests::windows_uac_only_interactive_other_always_prints ... ok
2026-07-31T04:01:42.3612621Z test helpfmt::tests::atx_header_at_line_start_strips_and_bolds ... ok
2026-07-31T04:01:42.3613072Z test helpfmt::tests::bold_styles_with_color_and_strips_without ... ok
2026-07-31T04:01:42.3613513Z test helpfmt::tests::code_styles_with_color_and_strips_without ... ok
2026-07-31T04:01:42.3614106Z test helpfmt::tests::color_enabled_truth_table ... ok
2026-07-31T04:01:42.3614497Z test helpfmt::tests::dual_contract_token_survives_strip_mode ... ok
2026-07-31T04:01:42.3615204Z test helpfmt::tests::dual_contract_token_unstyled_while_prose_styles_on_color ... ok
2026-07-31T04:01:42.3615762Z test helpfmt::tests::empty_and_unmatched_markers_stay_literal ... ok
2026-07-31T04:01:42.3616148Z test helpfmt::tests::link_becomes_its_text ... ok
2026-07-31T04:01:42.3616516Z test helpfmt::tests::marker_never_spans_a_hard_break ... ok
2026-07-31T04:01:42.3616881Z test helpfmt::tests::marker_spans_a_clap_soft_wrap ... ok
2026-07-31T04:01:42.3617129Z test helpfmt::tests::multibyte_text_survives ... ok
2026-07-31T04:01:42.3617382Z test helpfmt::tests::nested_code_inside_bold_styles_both ... ok
2026-07-31T04:01:42.3617730Z test helpfmt::tests::plain_text_is_unchanged ... ok
2026-07-31T04:01:42.3618304Z test helpfmt::tests::preexisting_ansi_is_passed_through_untouched ... ok
2026-07-31T04:01:42.3618814Z test helpfmt::tests::resolve_console_color_strips_when_vt_unavailable ... ok
2026-07-31T04:01:42.3620916Z test picker::data::tests::disambiguate_project_ids_cases ... ok
2026-07-31T04:01:42.3623013Z test picker::data::tests::driven_by_display_renders_name_not_hex ... ok
2026-07-31T04:01:42.3723944Z test cli::tests::purge_offline_gate_and_self_guard ... ok
2026-07-31T04:01:44.6217975Z test cli::tests::the_evidence_census_reads_each_local_source ... ok
2026-07-31T04:01:54.4385636Z test cli::tests::resolve_proof_target_override_reads_on_disk ... ok
2026-07-31T04:01:54.4386366Z test picker::data::tests::indexed_projection_full_w2shaped_and_absent_legs ... ok
2026-07-31T04:01:54.4395349Z test picker::data::tests::non_drivable_predicate_covers_worker_and_psyche ... ok
2026-07-31T04:01:54.4690695Z test cli::tests::purge_removes_every_record ... ok
2026-07-31T04:01:54.9969046Z test cli::tests::shell_channels_relay_sensory_and_text_file ... ok
2026-07-31T04:01:54.9971368Z test picker::data::tests::project_refs_from_sessions_excludes_owlery_and_dedups_newest_first ... ok
2026-07-31T04:01:54.9972969Z test picker::data::tests::project_refs_from_unions_fresh_origin_and_store_branches ... ok
2026-07-31T04:01:54.9974526Z test picker::data::tests::reconcile_overrides_subnet_with_local_roster ... ok
2026-07-31T04:01:55.0459066Z test cli::tests::shell_owner_exclusivity_negatives ... ok
2026-07-31T04:01:55.1533030Z test cli::tests::shell_relink_relaunches_offline_instances_only ... ok
2026-07-31T04:01:55.1535440Z test picker::data::tests::resume_rows_derive_per_row_project_and_drop_owlery_sessions ... ok
2026-07-31T04:01:55.3325620Z test cli::tests::shell_spawn_approval_floor_gates ... ok
2026-07-31T04:01:55.3326397Z test picker::data::tests::row_status_drives_unbound_display ... ok
2026-07-31T04:01:55.7392415Z test cli::tests::shell_spawn_cap_and_over_cap_gates ... ok
2026-07-31T04:01:55.7393713Z test picker::model::tests::adapter_tree_nests_profiles ... ok
2026-07-31T04:01:55.7395340Z test picker::model::tests::back_unwinds ... ok
2026-07-31T04:01:55.7396778Z test picker::model::tests::build_project_choices_head_here_rest ... ok
2026-07-31T04:01:55.7398235Z test picker::model::tests::category_labels_render_display_forms ... ok
2026-07-31T04:01:55.7399801Z test picker::model::tests::category_ring_wraps ... ok
2026-07-31T04:01:55.7401839Z test picker::model::tests::change_adapter_picks_and_returns_to_confirm ... ok
2026-07-31T04:01:55.7403324Z test picker::model::tests::choose_project_outcome_bakes_cwd_and_diverts ... ok
2026-07-31T04:01:55.7404777Z test picker::model::tests::confirm_local_offline_unchanged_by_wake_split ... ok
2026-07-31T04:01:55.7406302Z test picker::model::tests::confirm_options_remote_suspended_is_wake_not_start ... ok
2026-07-31T04:01:55.7407770Z test picker::model::tests::confirm_options_status_dependent ... ok
2026-07-31T04:01:55.7409447Z test picker::model::tests::confirm_terminal_routes ... ok
2026-07-31T04:01:55.7411092Z test picker::model::tests::confirm_terminal_wake_carries_raw_node ... ok
2026-07-31T04:01:55.7412689Z test picker::model::tests::create_new_multisubnet_inserts_home_layer ... ok
2026-07-31T04:01:55.7414224Z test picker::model::tests::create_outcome_bakes_run ... ok
2026-07-31T04:01:55.7415603Z test picker::model::tests::cursor_clamps ... ok
2026-07-31T04:01:55.7417202Z test picker::model::tests::display_mapping_matrix ... ok
2026-07-31T04:01:55.7418863Z test picker::model::tests::display_status_four_state_type_gated ... ok
2026-07-31T04:01:55.7420462Z test picker::model::tests::display_status_unbound_is_hollow_and_attachable ... ok
2026-07-31T04:01:55.7421988Z test picker::model::tests::empty_scope_opens_create ... ok
2026-07-31T04:01:55.7423373Z test picker::model::tests::ep_display_glyph_and_square_palette ... ok
2026-07-31T04:01:55.7424703Z test picker::model::tests::esc_backs_out_of_home_layer ... ok
2026-07-31T04:01:55.7427939Z test picker::model::tests::filter_narrows ... ok
2026-07-31T04:01:55.7429714Z test picker::model::tests::from_resource_row_maps_gossiped_adapter_projects_controlled ... ok
2026-07-31T04:01:55.7431172Z test picker::model::tests::home_selection_bakes_into_run_subnet ... ok
2026-07-31T04:01:55.7432628Z test picker::model::tests::kind_routes ... ok
2026-07-31T04:01:55.7434395Z test picker::model::tests::launch_keys_live_only_on_launch_capable_highlights ... ok
2026-07-31T04:01:55.7435595Z test picker::model::tests::prefill_jumps_to_create ... ok
2026-07-31T04:01:55.7437935Z test picker::model::tests::project_filter_keys_on_slug_while_tab_renders_display ... ok
2026-07-31T04:01:55.7444474Z test picker::model::tests::purge_confirm_yields_outcome_and_backs_out ... ok
2026-07-31T04:01:55.7445063Z test picker::model::tests::purge_shortcut_gates_to_offline_local ... ok
2026-07-31T04:01:55.7446684Z test picker::model::tests::reenter_create_keeps_or_clears_id ... ok
2026-07-31T04:01:55.7447986Z test picker::model::tests::remove_endpoint_drops_row_and_clamps_cursor ... ok
2026-07-31T04:01:55.7449505Z test picker::model::tests::resume_outcome_adapter_follows_recorded_row ... ok
2026-07-31T04:01:55.7450962Z test picker::model::tests::resume_outcome_bakes_session ... ok
2026-07-31T04:01:55.7453664Z test picker::model::tests::resume_title_render ... ok
2026-07-31T04:01:55.7454804Z test picker::model::tests::should_offer_project_choice_fire_conditions ... ok
2026-07-31T04:01:55.7456274Z test picker::model::tests::single_subnet_skips_home_layer ... ok
2026-07-31T04:01:55.7457392Z test picker::model::tests::suspended_is_distinct_from_offline ... ok
2026-07-31T04:01:55.7458903Z test picker::model::tests::visible_partitions_and_sorts ... ok
2026-07-31T04:01:55.7460727Z test picker::shortcut::tests::bakes_create_attach_by_default ... ok
2026-07-31T04:01:55.7462351Z test picker::shortcut::tests::bakes_resume_and_action ... ok
2026-07-31T04:01:55.7463618Z test picker::shortcut::tests::basename_is_parameterized ... ok
2026-07-31T04:01:55.7465018Z test picker::shortcut::tests::sentinel_detection ... ok
2026-07-31T04:01:55.7737811Z test picker::shortcut::tests::write_create_update_refuse ... ok
2026-07-31T04:01:55.7739259Z test picker::tests::backspace_backs_out_screens_like_esc ... ok
2026-07-31T04:01:55.7740925Z test picker::tests::backspace_stays_char_delete_in_text_contexts ... ok
2026-07-31T04:01:55.7742230Z test picker::tests::purge_outcomes_convert_to_flash_lines ... ok
2026-07-31T04:01:55.7818205Z test picker::tests::purge_transition_reconstructs_the_complete_screen_after_external_mutation ... ok
2026-07-31T04:01:55.7843721Z test picker::view::tests::adapter_tree_buffer ... ok
2026-07-31T04:01:55.7880871Z test picker::view::tests::change_adapter_screen_renders_tree_and_apply_legend ... ok
2026-07-31T04:01:55.7917422Z test picker::view::tests::choose_project_buffer_keeps_confirm_panel ... ok
2026-07-31T04:01:55.7957516Z test picker::view::tests::confirm_buffer_options ... ok
2026-07-31T04:01:55.8002758Z test picker::view::tests::confirm_fork_and_shortcut_labels_are_dir_relative ... ok
2026-07-31T04:01:55.8046351Z test picker::view::tests::confirm_panel_history_renders_display_not_slug ... ok
2026-07-31T04:01:55.8077183Z test picker::view::tests::create_home_lists_subnets ... ok
2026-07-31T04:01:55.8133710Z test picker::view::tests::footer_hints_h_s_only_when_launch_keys_live ... ok
2026-07-31T04:01:55.8161548Z test picker::view::tests::kind_buffer ... ok
2026-07-31T04:01:55.8195376Z test picker::view::tests::pick_buffer_has_squares_and_description ... ok
2026-07-31T04:01:55.8237327Z test picker::view::tests::pick_empty_category_hint ... ok
2026-07-31T04:01:55.8509454Z test picker::view::tests::pick_status_line_four_state ... ok
2026-07-31T04:01:55.8565658Z test picker::view::tests::resume_buffer_keeps_confirm_panel ... ok
2026-07-31T04:01:55.8606521Z test picker::view::tests::resume_buffer_lists_sessions ... ok
2026-07-31T04:02:07.1069907Z test cli::tests::shell_spawn_gates_on_the_registered_set ... ok
2026-07-31T04:02:07.1071353Z test rc::tests::attach_gate_routes_on_session_truth_not_the_row ... ok
2026-07-31T04:02:07.1488785Z test cli::tests::shell_spawn_profiled_option_resolves_and_shares_cap ... ok
2026-07-31T04:02:07.2587541Z test cli::tests::shutdown_and_stop_share_the_postcondition_and_differ_only_in_ceremony ... ok
2026-07-31T04:02:07.2588437Z test rc::tests::bracketed_paste_framing_is_exact_and_content_verbatim ... ok
2026-07-31T04:02:07.2589877Z test rc::tests::broker_host_child ... ok
2026-07-31T04:02:07.2591441Z test rc::tests::canonical_wire_id_strips_qualifiers_to_the_bare_id ... ok
2026-07-31T04:02:07.2592965Z test rc::tests::classify_read_err_eof_is_graceful_not_fatal ... ok
2026-07-31T04:02:07.2594268Z test rc::tests::clipboard_paste_wraps_nonempty_and_noops_on_empty_or_failure ... ok
2026-07-31T04:02:07.2595583Z test rc::tests::detach_keybind_semantics ... ok
2026-07-31T04:02:07.2597367Z test rc::tests::detach_prefix_spans_chunks ... ok
2026-07-31T04:02:07.2598715Z test rc::tests::display_guard_postlude_exactly_once_and_inactive_silent ... ok
2026-07-31T04:02:07.2599932Z test rc::tests::driver_phrase_names_own_node_plainly_but_remote_verbatim ... ok
2026-07-31T04:02:07.3608320Z test cli::tests::shutdown_on_a_broker_hosted_endpoint_stamps_after_the_reap ... ok
2026-07-31T04:02:07.3609697Z test rc::tests::first_event_stall_decision ... ok
2026-07-31T04:02:07.3610780Z test rc::tests::fold_code_key_prompt_rules ... ok
2026-07-31T04:02:07.3611934Z test rc::tests::give_up_copy_names_daemon_down_vs_generic ... ok
2026-07-31T04:02:07.3612798Z test rc::tests::harness_only_row_matches_online_seatless_live_agents_only ... ok
2026-07-31T04:02:07.3614012Z test rc::tests::identity_line_format ... ok
2026-07-31T04:02:07.3615563Z test rc::tests::key_event_step_detach_sm ... ok
2026-07-31T04:02:07.3616647Z test rc::tests::mouse_is_paste_only_right_button_down ... ok
2026-07-31T04:02:07.3618067Z test rc::tests::mouse_mode_decset_scan_survives_split_across_chunks ... ok
2026-07-31T04:02:07.3619320Z test rc::tests::mouse_mode_decset_scan_tracks_enable_and_sgr ... ok
2026-07-31T04:02:07.3622661Z test rc::tests::op_minter_distinct_and_monotonic ... ok
2026-07-31T04:02:07.3623811Z test rc::tests::pre_broker_busy_guidance_fires_for_any_driver_not_just_remote ... ok
2026-07-31T04:02:07.3624735Z test rc::tests::public_attach_failure_maps_deadline_class_only ... ok
2026-07-31T04:02:07.3626458Z test rc::tests::pump_status_emit_sequence_over_write_sink ... ok
2026-07-31T04:02:07.3957200Z test cli::tests::shutdown_on_a_harness_hosted_endpoint_claims_no_process ... ok
2026-07-31T04:02:07.3958542Z test rc::tests::reassert_scanner_survives_split_across_chunks ... ok
2026-07-31T04:02:07.3959989Z test rc::tests::reassert_scanner_triggers_only_on_region_destroyers ... ok
2026-07-31T04:02:07.3961485Z test rc::tests::reconnect_banner_clears_and_centers ... ok
2026-07-31T04:02:07.3962841Z test rc::tests::reconnect_banner_shows_the_countdown ... ok
2026-07-31T04:02:07.3964297Z test rc::tests::reconnect_class_only_severed_transport_redrives ... ok
2026-07-31T04:02:07.3965276Z test rc::tests::reconnect_remaining_secs_counts_down_ceil ... ok
2026-07-31T04:02:07.3966531Z test rc::tests::reconnect_window_expiry_decision ... ok
2026-07-31T04:02:07.3967915Z test rc::tests::scroll_dir_classifies_wheel_only ... ok
2026-07-31T04:02:07.3969170Z test rc::tests::scroll_sgr_emits_exact_xterm_bytes ... ok
2026-07-31T04:02:07.3970396Z test rc::tests::serve_eof_severed_vs_refused ... ok
2026-07-31T04:02:07.3971694Z test rc::tests::status_assert_reserves_row1_then_repaints ... ok
2026-07-31T04:02:07.3973055Z test rc::tests::status_repaint_exact_bytes_and_right_align ... ok
2026-07-31T04:02:07.3974225Z test rc::tests::status_restore_exact_bytes ... ok
2026-07-31T04:02:07.3975325Z test rc::tests::status_row_marker_is_disabled_by_flag ... ok
2026-07-31T04:02:07.3976731Z test rc::tests::status_update_size_repoints_geometry ... ok
2026-07-31T04:02:07.3978742Z test rc::tests::teardown_matrix_postlude_precedes_prose_across_every_final_class ... ok
2026-07-31T04:02:07.3979946Z test rc::tests::the_client_refuses_engine_room_viewports_and_qualified_targets_only ... ok
2026-07-31T04:02:07.3981393Z test rc::tests::translate_key_event_emits_exact_xterm_vt ... ok
2026-07-31T04:02:07.3982778Z test rc::tests::with_vt_output_disables_newline_auto_return ... ok
2026-07-31T04:02:07.3984008Z test rc::tests::with_vt_output_enables_virtual_terminal_processing ... ok
2026-07-31T04:02:07.5436934Z test cli::tests::spt_hosted_no_relay_detection ... ok
2026-07-31T04:02:07.6126811Z test picker::data::tests::gather_endpoints_projects_from_seeded_index_with_zero_git ... ok
2026-07-31T04:02:07.6753017Z test picker::data::tests::gather_renders_live_unbound ... ok
2026-07-31T04:02:07.9673352Z test picker::data::tests::home_subnet_options_is_mru_ordered ... ok
2026-07-31T04:02:07.9842662Z test picker::data::tests::own_node_tab_label_falls_back_to_keyprefix ... ok
2026-07-31T04:02:08.0515879Z test picker::data::tests::picker_excludes_flat_worker_and_psyche ... ok
2026-07-31T04:02:08.0674930Z test picker::data::tests::remote_picker_renders_suspended_dead_perch_offline ... ok
2026-07-31T04:02:08.0676204Z test roster::tests::match_self_by_ancestry_disambiguates_and_none ... ok
2026-07-31T04:02:08.0914271Z test picker::data::tests::remote_rows_render_full_palette_parity ... ok
2026-07-31T04:02:08.0915832Z test teardown::tests::an_unconfirmed_row_over_a_dead_root_is_stale_not_a_survivor ... ok
2026-07-31T04:02:08.1043489Z test picker::data::tests::resume_rows_title_from_index_cwd_map_with_pure_fallback ... ok
2026-07-31T04:02:08.1044722Z test teardown::tests::timeout_refuses_the_stamp_and_names_the_survivor ... ok
2026-07-31T04:02:08.1046102Z test teardown::tests::topology_gate_is_controllable_true_only ... ok
2026-07-31T04:02:08.1047416Z test tests::broken_pipe_panic_classifier ... ok
2026-07-31T04:02:08.1049142Z test wansend::tests::bare_id_resolves_across_remote_snapshot ... ok
2026-07-31T04:02:08.1050677Z test wansend::tests::classify_wan_reply_only_delivers_on_positive_outcomes ... ok
2026-07-31T04:02:08.1137615Z test wansend::tests::load_snapshots_degrades_on_junk ... ok
2026-07-31T04:02:08.1140540Z test wansend::tests::refusals_render_copy_paste_targets ... ok
2026-07-31T04:02:08.1235194Z test picker::data::tests::shared_machine_is_one_group_with_unioned_subnets ... ok
2026-07-31T04:02:08.1296383Z test teardown::tests::liveness_proof_needs_a_real_snapshot_and_finds_this_process ... ok
2026-07-31T04:02:08.1440025Z test rc::tests::attach_against_stopped_daemon_never_spawns_and_exits_loud ... ok
2026-07-31T04:02:08.1714005Z test rc::tests::attach_offline_endpoint_short_circuits_clean ... ok
2026-07-31T04:02:08.1875200Z 
2026-07-31T04:02:08.1875477Z running 1 test
2026-07-31T04:02:08.2315385Z NTP_TOTP_UNCORRECTED: all NTP servers unreachable — ceremony clock = raw system clock
2026-07-31T04:02:08.2330417Z CONN_LIFECYCLE: conn=1 role=brain wall_ms=1785470528232 mono_ms=0 event=transport-close poisoned=false timed_out=false [REQ-CONN-POISON-ATTRIBUTION]
2026-07-31T04:02:08.2332519Z CONN_LIFECYCLE: conn=3 role=brain wall_ms=1785470528233 mono_ms=0 event=write-start [REQ-CONN-POISON-ATTRIBUTION]
2026-07-31T04:02:08.3867645Z CONN_LIFECYCLE: conn=2 role=brain controller session=1 endpoint=reheal by=local wall_ms=1785470528386 mono_ms=153 event=controller-attach session=1 from_seq=0 [REQ-CONN-POISON-ATTRIBUTION]
2026-07-31T04:02:08.3871649Z CONN_LIFECYCLE: conn=2 role=brain controller session=1 endpoint=reheal by=local wall_ms=1785470528387 mono_ms=154 event=write-start [REQ-CONN-POISON-ATTRIBUTION]
2026-07-31T04:02:08.3881682Z CONN_LIFECYCLE: conn=4 role=brain wall_ms=1785470528388 mono_ms=155 event=write-start [REQ-CONN-POISON-ATTRIBUTION]
2026-07-31T04:02:08.4021061Z CONN_LIFECYCLE: conn=4 role=brain stream-subscriber stream=2 wall_ms=1785470528401 mono_ms=169 event=stream-sub-attach stream=2 from_seq=0 [REQ-CONN-POISON-ATTRIBUTION]
2026-07-31T04:02:08.4355217Z CONN_LIFECYCLE: conn=5 role=brain wall_ms=1785470528435 mono_ms=202 event=write-start [REQ-CONN-POISON-ATTRIBUTION]
2026-07-31T04:02:08.4356061Z CONN_LIFECYCLE: conn=5 role=brain wall_ms=1785470528435 mono_ms=202 event=transport-close poisoned=false timed_out=false [REQ-CONN-POISON-ATTRIBUTION]
2026-07-31T04:02:08.4359240Z CONN_LIFECYCLE: conn=6 role=brain wall_ms=1785470528435 mono_ms=202 event=write-start [REQ-CONN-POISON-ATTRIBUTION]
2026-07-31T04:02:08.4361321Z CONN_LIFECYCLE: conn=6 role=brain stream-subscriber stream=1 wall_ms=1785470528436 mono_ms=203 event=stream-sub-attach stream=1 from_seq=0 [REQ-CONN-POISON-ATTRIBUTION]
2026-07-31T04:02:08.4371086Z CONN_LIFECYCLE: conn=6 role=brain stream-subscriber stream=1 viewer session=1 endpoint=reheal vid=0 wall_ms=1785470528437 mono_ms=204 event=viewer-attach session=1 vid=0 from_seq=0 [REQ-CONN-POISON-ATTRIBUTION]
2026-07-31T04:02:08.4373477Z SUBSCRIBE_DECISION: session=1 endpoint=reheal by=fd1724385aa0c75b64fb78cd602fa1d991fdebf76b13c58ed702eac835e9f618 conn=6 intent=viewer old_by=- old_gen=0 req_gen=0 decision=viewer
2026-07-31T04:02:08.4420453Z CONN_LIFECYCLE: conn=6 role=brain stream-subscriber stream=1 viewer session=1 endpoint=reheal vid=0 viewer session=1 endpoint=reheal vid=1 wall_ms=1785470528441 mono_ms=209 event=viewer-attach session=1 vid=1 from_seq=0 [REQ-CONN-POISON-ATTRIBUTION]
2026-07-31T04:02:08.4422605Z SUBSCRIBE_DECISION: session=1 endpoint=reheal by=fd1724385aa0c75b64fb78cd602fa1d991fdebf76b13c58ed702eac835e9f618 conn=6 intent=viewer old_by=- old_gen=0 req_gen=0 decision=viewer
2026-07-31T04:02:08.5959047Z 
2026-07-31T04:02:08.5959425Z running 1 test
2026-07-31T04:02:08.6269003Z NTP_TOTP_UNCORRECTED: all NTP servers unreachable — ceremony clock = raw system clock
2026-07-31T04:02:08.6390173Z CONN_LIFECYCLE: conn=1 role=brain wall_ms=1785470528638 mono_ms=0 event=transport-close poisoned=false timed_out=false [REQ-CONN-POISON-ATTRIBUTION]
2026-07-31T04:02:08.6392078Z CONN_LIFECYCLE: conn=3 role=brain wall_ms=1785470528639 mono_ms=0 event=write-start [REQ-CONN-POISON-ATTRIBUTION]
2026-07-31T04:02:09.0724530Z CONN_LIFECYCLE: conn=2 role=brain controller session=1 endpoint=reheal by=local wall_ms=1785470529069 mono_ms=430 event=controller-attach session=1 from_seq=0 [REQ-CONN-POISON-ATTRIBUTION]
2026-07-31T04:02:09.0760192Z CONN_LIFECYCLE: conn=2 role=brain controller session=1 endpoint=reheal by=local wall_ms=1785470529070 mono_ms=431 event=write-start [REQ-CONN-POISON-ATTRIBUTION]
2026-07-31T04:02:09.4912623Z CONN_LIFECYCLE: conn=4 role=brain wall_ms=1785470529491 mono_ms=852 event=write-start [REQ-CONN-POISON-ATTRIBUTION]
2026-07-31T04:02:09.5512904Z CONN_LIFECYCLE: conn=4 role=brain stream-subscriber stream=2 wall_ms=1785470529551 mono_ms=912 event=stream-sub-attach stream=2 from_seq=0 [REQ-CONN-POISON-ATTRIBUTION]
2026-07-31T04:02:09.5638159Z CONN_LIFECYCLE: conn=5 role=brain wall_ms=1785470529563 mono_ms=924 event=write-start [REQ-CONN-POISON-ATTRIBUTION]
2026-07-31T04:02:09.5639308Z CONN_LIFECYCLE: conn=5 role=brain wall_ms=1785470529563 mono_ms=924 event=transport-close poisoned=false timed_out=false [REQ-CONN-POISON-ATTRIBUTION]
2026-07-31T04:02:09.5642088Z CONN_LIFECYCLE: conn=6 role=brain wall_ms=1785470529564 mono_ms=925 event=write-start [REQ-CONN-POISON-ATTRIBUTION]
2026-07-31T04:02:09.5644178Z CONN_LIFECYCLE: conn=6 role=brain stream-subscriber stream=1 wall_ms=1785470529564 mono_ms=925 event=stream-sub-attach stream=1 from_seq=0 [REQ-CONN-POISON-ATTRIBUTION]
2026-07-31T04:02:09.5646293Z CONN_LIFECYCLE: conn=6 role=brain stream-subscriber stream=1 viewer session=1 endpoint=reheal vid=0 wall_ms=1785470529564 mono_ms=925 event=viewer-attach session=1 vid=0 from_seq=0 [REQ-CONN-POISON-ATTRIBUTION]
2026-07-31T04:02:09.5649305Z SUBSCRIBE_DECISION: session=1 endpoint=reheal by=fd1724385aa0c75b64fb78cd602fa1d991fdebf76b13c58ed702eac835e9f618 conn=6 intent=viewer old_by=- old_gen=0 req_gen=0 decision=viewer
2026-07-31T04:02:09.5651015Z CONN_LIFECYCLE: conn=6 role=brain stream-subscriber stream=1 viewer session=1 endpoint=reheal vid=0 viewer session=1 endpoint=reheal vid=1 wall_ms=1785470529564 mono_ms=926 event=viewer-attach session=1 vid=1 from_seq=0 [REQ-CONN-POISON-ATTRIBUTION]
2026-07-31T04:02:09.5652865Z SUBSCRIBE_DECISION: session=1 endpoint=reheal by=fd1724385aa0c75b64fb78cd602fa1d991fdebf76b13c58ed702eac835e9f618 conn=6 intent=viewer old_by=- old_gen=0 req_gen=0 decision=viewer
2026-07-31T04:02:09.8833495Z CONN_LIFECYCLE: conn=6 role=brain stream-subscriber stream=1 viewer session=1 endpoint=reheal vid=0 viewer session=1 endpoint=reheal vid=1 wall_ms=1785470529883 mono_ms=1244 event=stream-sub-release stream=1 [REQ-CONN-POISON-ATTRIBUTION]
2026-07-31T04:02:09.8835193Z CONN_LIFECYCLE: conn=7 role=brain wall_ms=1785470529883 mono_ms=1244 event=transport-close poisoned=false timed_out=false [REQ-CONN-POISON-ATTRIBUTION]
2026-07-31T04:02:09.8892891Z test rc::tests::attach_viewport_reconnects_across_a_broker_bounce ... ok
2026-07-31T04:02:10.1227424Z test rc::tests::establish_attach_reuses_the_probes_carried_pump_conn ... ok
2026-07-31T04:02:12.0324121Z test rc::tests::qualified_targets_attach_with_bare_wire_id ... ok
2026-07-31T04:02:12.0453477Z test roster::tests::detect_self_by_ancestry_none_when_no_ancestor_owns_a_perch ... ok
2026-07-31T04:02:12.0672667Z test roster::tests::detect_self_by_ancestry_resolves_a_live_ancestor_perch ... ok
2026-07-31T04:02:12.0800183Z test roster::tests::detect_self_id_endpoint_id_leg_is_label_only_and_perch_gated ... ok
2026-07-31T04:02:12.1080021Z test roster::tests::detect_self_id_resolves_identity_with_zero_git_spawns ... ok
2026-07-31T04:02:12.1199674Z test roster::tests::detect_self_resolves_spt_hosted_perch_via_parent_pid ... ok
2026-07-31T04:02:12.1221475Z test roster::tests::enumerate_yields_offline_corrupt_row_for_unparseable_info ... ok
2026-07-31T04:02:12.1433863Z test roster::tests::list_all_perch_dirs_enumerates_nested_psyche_for_self_resolution ... ok
2026-07-31T04:02:12.1632496Z test roster::tests::parent_pid_candidates_stay_ancestry_gated ... ok
2026-07-31T04:02:12.5488772Z test wansend::tests::remote_rest_suspends_and_wakes_with_the_deferred_gate ... ok
2026-07-31T04:02:12.6197625Z test wansend::tests::resolve_and_dial_owner_dials_the_resolved_node ... ok
2026-07-31T04:02:12.6761097Z test wansend::tests::resolve_and_dial_owner_is_honest_on_resolution_misses ... ok
2026-07-31T04:02:12.6874240Z test wansend::tests::seed_first_addr_prefers_the_cached_direct_address ... ok
2026-07-31T04:02:12.8948851Z test wansend::tests::wan_send_ships_to_the_resolved_node ... ok
2026-07-31T04:02:12.8949182Z 
2026-07-31T04:02:12.8949470Z test result: ok. 475 passed; 0 failed; 0 ignored; 0 measured; 0 filtered out; finished in 72.43s
2026-07-31T04:02:12.8949860Z 
2026-07-31T04:02:12.9197412Z      Running unittests tests\fixtures\translate_proof_fixture.rs (target\debug\deps\translate_proof_fixture-6c1f32e3e25e0c2c.exe)
2026-07-31T04:02:13.0388634Z 
2026-07-31T04:02:13.0388950Z running 0 tests
2026-07-31T04:02:13.0389104Z 
2026-07-31T04:02:13.0389335Z test result: ok. 0 passed; 0 failed; 0 ignored; 0 measured; 0 filtered out; finished in 0.00s
2026-07-31T04:02:13.0389566Z 
2026-07-31T04:02:13.0400507Z      Running unittests src\lib.rs (target\debug\deps\spt_daemon-4d86a85ce347685e.exe)
2026-07-31T04:02:14.2774225Z 
2026-07-31T04:02:14.2774535Z running 723 tests
2026-07-31T04:02:14.2779787Z test access::tests::the_knock_exemption_hook_refuses_everything_today ... ok
2026-07-31T04:02:14.2780239Z test access::tests::the_inbound_lock_answers_replies_only_and_only_while_controlled ... ok
2026-07-31T04:02:14.2781118Z test activity::tests::a_token_change_with_an_identical_state_owes_a_push ... ok
2026-07-31T04:02:14.2781565Z test activity::tests::an_identical_observation_pushes_nothing ... ok
2026-07-31T04:02:14.2781971Z test activity::tests::a_state_change_owes_a_push_both_directions ... ok
2026-07-31T04:02:14.2782341Z test activity::tests::an_unseen_link_owes_a_push ... ok
2026-07-31T04:02:14.2783510Z test activity::tests::remember_forgets_a_vanished_link_so_its_return_re_pushes ... ok
2026-07-31T04:02:14.2785229Z test activity::tests::the_diff_is_per_link_not_per_owner ... ok
2026-07-31T04:02:14.2798130Z test activity::tests::observe_links_on_an_absent_owlery_is_empty ... ok
2026-07-31T04:02:14.2800147Z test adapter_update::tests::delegated_attested_delegates_command ... ok
2026-07-31T04:02:14.2801526Z test adapter_update::tests::delegated_unattested_is_skipped ... ok
2026-07-31T04:02:14.2814601Z test activity::tests::the_flip_marker_is_idempotent_to_drop_and_taken_exactly_once ... ok
2026-07-31T04:02:14.2898344Z test adapter_update::tests::file_pull_tampered_bytes_rejected ... ok
2026-07-31T04:02:14.2900900Z test adapter_update::tests::file_pull_without_payload_is_skipped ... ok
2026-07-31T04:02:14.2905424Z test adapter_update::tests::file_pull_verified_against_adapter_key ... ok
2026-07-31T04:02:14.2906792Z test adapter_update::tests::gh_release_is_managed_cli_side_not_in_pure_plan ... ok
2026-07-31T04:02:14.2907267Z test activity::tests::an_owner_with_no_linked_shell_is_not_observed ... ok
2026-07-31T04:02:14.2920629Z test access::tests::corrupt_store_degrades_closed_but_replies_survive ... ok
2026-07-31T04:02:14.2931745Z test activity::tests::an_unstamped_owner_observes_undated_and_stays_silent_across_sweeps ... ok
2026-07-31T04:02:14.2959876Z test activity::tests::observe_links_sees_only_online_shells_holding_a_token ... ok
2026-07-31T04:02:14.3000539Z test adapter_update::tests::file_pull_wrong_key_rejected ... ok
2026-07-31T04:02:14.3001434Z test adapter_update::tests::ripple_conducts_each_adapter_in_order ... ok
2026-07-31T04:02:14.3002314Z test access::tests::discover_gate_withholds_everything_while_degraded ... ok
2026-07-31T04:02:14.3130636Z test access::tests::discover_gate_discloses_per_viewer ... ok
2026-07-31T04:02:17.0659529Z test applyhost::tests::apply_staged_update_set_refuses_broker_touching_payloads ... ok
2026-07-31T04:02:17.0660782Z test applyhost::tests::apply_staged_daemonless_swaps_binary_with_no_broker ... ok
2026-07-31T04:02:17.0661337Z test adapter_update::tests::ripple_registered_uses_the_registered_set ... ok
2026-07-31T04:02:17.0661910Z test applyhost::tests::apply_staged_refuses_platform_blind_or_mismatched_single ... ok
2026-07-31T04:02:17.0662791Z test applyhost::tests::broker_reports_its_compiled_image_version_over_ipc ... ok
2026-07-31T04:02:17.0663469Z test applyhost::tests::apply_staged_gates_fail_closed_with_the_seat_untouched ... ok
2026-07-31T04:02:17.0664260Z test applyhost::tests::apply_staged_swaps_binary_and_hands_off_without_touching_the_endpoint ... ok
2026-07-31T04:02:17.0664888Z test access::tests::the_engine_room_is_disclosed_only_to_the_viewers_it_chose ... ok
2026-07-31T04:02:17.0700895Z test access::tests::gate_feeds_the_proven_sender_endpoint_tier ... ok
2026-07-31T04:02:17.0701341Z test access::tests::gate_is_per_surface ... ok
2026-07-31T04:02:17.0701722Z test access::tests::same_node_always_passes_without_minting ... ok
2026-07-31T04:02:17.0702245Z test applyhost::tests::staged_already_applied_classifies_up_to_date_vs_newer ... ok
2026-07-31T04:02:17.0721303Z test attach::tests::the_engine_room_has_no_viewport_and_takes_its_controls_from_home ... ok
2026-07-31T04:02:17.0727670Z test applyhost::tests::apply_staged_daemonless_holds_the_fail_closed_gates ... ok
2026-07-31T04:02:17.0728389Z test applyhost::tests::apply_staged_update_set_selects_local_platform_artifact ... ok
2026-07-31T04:02:17.0729063Z test applyhost::tests::apply_staged_refuses_a_quarantined_version ... ok
2026-07-31T04:02:17.0729583Z test brain::tests::peer_reply_deadline_caps_below_carrier_deadline ... ok
2026-07-31T04:02:17.0734022Z test brain::tests::a_flagged_sync_frame_baselines_forward_never_backward_on_both_paths ... ok
2026-07-31T04:02:17.0734832Z test brain::tests::reclassify_peer_reply_maps_timeout_off_poison ... ok
2026-07-31T04:02:17.0735365Z test brain::tests::controller_resume_from_floor_refetches_after_a_gap ... ok
2026-07-31T04:02:17.0735857Z test brain::tests::cold_brain_still_rejects_a_forward_output_gap ... ok
2026-07-31T04:02:17.0737656Z test brain::tests::skip_to_live_accepts_a_forward_seq_jump_via_snap_above ... ok
2026-07-31T04:02:17.0738178Z test brainproc::tests::brain_child_args_carry_generation_and_reason ... ok
2026-07-31T04:02:17.0943434Z test brainproc::tests::appended_padding_flips_exe_hash ... ok
2026-07-31T04:02:17.0944778Z test brainproc::tests::bytes_gate_truth_table ... ok
2026-07-31T04:02:17.0945358Z test brain::tests::viewer_snap_attach_accepts_a_forward_output_gap ... ok
2026-07-31T04:02:17.0945915Z test brainproc::tests::backoff_doubles_on_fast_death_resets_when_healthy ... ok
2026-07-31T04:02:17.0946484Z test brain::tests::an_old_broker_wire_without_the_sync_key_keeps_every_legacy_path ... ok
2026-07-31T04:02:17.0950955Z test brainproc::tests::consumer_gate_spawns_once_when_net_enabled ... ok
2026-07-31T04:02:17.1103199Z test access::tests::gate_decision_table ... ok
2026-07-31T04:02:17.1107080Z test brainproc::tests::ready_exe_hash_parses_and_is_n1_readable ... ok
2026-07-31T04:02:17.1159897Z test applyhost::tests::apply_staged_without_broker_hosted_sessions_swaps_binary ... ok
2026-07-31T04:02:17.1161628Z test brainproc::tests::ready_generation_parses_stamp_and_fails_safe ... ok
2026-07-31T04:02:17.1193562Z test brainproc::tests::ready_generation_at_reads_file_and_absent_is_none ... ok
2026-07-31T04:02:17.1195263Z test brainproc::tests::rollback_running_version_is_prior_not_n_minus_one ... ok
2026-07-31T04:02:17.1289323Z test access::tests::the_engine_room_refuses_even_this_nodes_own_unsolicited_inbound ... ok
2026-07-31T04:02:17.1290867Z test brainproc::tests::select_brain_exe_prefers_canonical_over_per_spawn_current_exe ... ok
2026-07-31T04:02:17.1457348Z test access::tests::the_inbound_lock_is_reached_through_the_sender_stamped_entry_point ... ok
2026-07-31T04:02:17.1458492Z test brainproc::tests::start_reason_arg_round_trips_and_is_lenient ... ok
2026-07-31T04:02:17.1557374Z test access::tests::reply_passes_where_unsolicited_refused ... ok
2026-07-31T04:02:17.1587165Z test attach::tests::viewer_and_driving_intents_gate_on_different_surfaces ... ok
2026-07-31T04:02:17.1594097Z test autostart::tests::empty_config_is_a_pure_noop ... ok
2026-07-31T04:02:17.1662511Z test autostart::tests::unresolved_adapter_loud_skips_before_any_launch ... ok
2026-07-31T04:02:17.4678774Z test brainproc::tests::rolled_back_record_spawns_rollback_binary_on_a_fresh_supervisor ... ok
2026-07-31T04:02:17.4746247Z test broker::tests::a_controller_resume_below_the_floor_is_served_the_repaint_shape ... ok
2026-07-31T04:02:17.4749927Z test broker::tests::a_failed_surface_resize_leaves_the_grid_geometry_unchanged ... ok
2026-07-31T04:02:17.4775726Z test broker::tests::a_full_controller_does_not_starve_a_viewer_or_block_the_drain ... ok
2026-07-31T04:02:17.4787130Z test broker::tests::a_gap_resume_on_the_same_conn_is_served_not_suppressed ... ok
2026-07-31T04:02:17.4790022Z test broker::tests::a_grow_keeps_old_geometry_wrapping_and_places_new_output_at_the_new_width ... ok
2026-07-31T04:02:17.5453613Z test applyhost::tests::refresh_brain_cycles_without_staging_or_swap_preconditions ... ok
2026-07-31T04:02:17.5466549Z test broker::tests::a_resume_at_the_floor_keeps_the_raw_ring_replay ... ok
2026-07-31T04:02:17.5478586Z test broker::tests::a_resumed_controller_never_rereceives_a_suppressed_seq ... ok
2026-07-31T04:02:17.5480607Z test broker::tests::a_second_transition_is_refused_while_one_is_in_flight ... ok
2026-07-31T04:02:17.5483331Z test broker::tests::a_shrink_parses_held_output_at_the_geometry_it_was_emitted_under ... ok
2026-07-31T04:02:17.5618582Z test broker::tests::a_reap_clears_the_control_stamps_but_never_the_hosting_authority ... ok
2026-07-31T04:02:17.5837702Z test applyhost::tests::brain_restart_verb_raises_the_supervisor_signal ... ok
2026-07-31T04:02:17.5839037Z test broker::tests::advance_delivered_is_monotonic ... ok
2026-07-31T04:02:17.5852906Z test broker::tests::an_aborted_transition_syncs_at_the_old_geometry_with_no_size_frame ... ok
2026-07-31T04:02:17.5860740Z test broker::tests::append_overflow_flags_the_evicted_viewer_for_skip_to_live ... ok
2026-07-31T04:02:17.5872791Z test broker::tests::apply_once_enqueues_ptywrite_exactly_once_and_dedups_replay ... ok
2026-07-31T04:02:17.7944846Z test broker::tests::a_take_and_a_detach_each_drop_the_engine_rooms_empowerments ... ok
2026-07-31T04:02:17.7946576Z test broker::tests::chunk_text_splits_and_reassembles_exactly ... ok
2026-07-31T04:02:17.7960630Z test broker::tests::clamp_or_reset_resets_a_torn_ring_only ... ok
2026-07-31T04:02:17.7971222Z test broker::tests::cold_attach_repaint_plus_next_differential_matches_independent_emulator ... ok
2026-07-31T04:02:17.7973298Z test broker::tests::contains_subslice_finds_contiguous_only ... ok
2026-07-31T04:02:17.7976702Z test broker::tests::contiguous_advance_freezes_on_a_gap ... ok
2026-07-31T04:02:17.7987735Z test broker::tests::controller_write_stall_predicate_distinguishes_wedged_from_idle ... ok
2026-07-31T04:02:17.7988236Z test broker::tests::delivered_cursor_advances_only_on_ok_and_is_monotonic ... ok
2026-07-31T04:02:17.9012041Z test broker::tests::attach_initial_batch_is_a_clean_alt_screen_repaint_not_the_raw_ring ... ok
2026-07-31T04:02:17.9012774Z test broker::tests::echo_verified_catches_a_swallowed_head ... ok
2026-07-31T04:02:17.9032012Z test broker::tests::equal_generation_same_conn_is_an_idempotent_replay ... ok
2026-07-31T04:02:17.9044267Z test broker::tests::exit_enqueues_behind_queued_output_per_sink ... ok
2026-07-31T04:02:17.9057219Z test broker::tests::gap_resume_resubscribe_preserves_the_generation_against_stale_replay ... ok
2026-07-31T04:02:17.9076864Z test broker::tests::generation_ladder_newer_supersedes_loudly_older_refused_both_intents ... ok
2026-07-31T04:02:17.9078883Z test broker::tests::input_enqueue_drops_and_stamps_on_full_then_heals_on_drain ... ok
2026-07-31T04:02:17.9080902Z test broker::tests::input_writer_preserves_strict_fifo_order_through_the_sole_writer ... ok
2026-07-31T04:02:17.9106073Z test broker::tests::local_controller_wedged_scopes_to_the_brains_own_conn ... ok
2026-07-31T04:02:17.9110717Z test broker::tests::lock_floor_recovers_a_poisoned_inject_floor ... ok
2026-07-31T04:02:17.9112383Z test broker::tests::miss_respool_is_once_then_dead_letters ... ok
2026-07-31T04:02:17.9113652Z test broker::tests::miss_strikes_exhausted_at_budget ... ok
2026-07-31T04:02:17.9115108Z test broker::tests::only_the_supervised_generation_can_claim_the_coordinator_image ... ok
2026-07-31T04:02:17.9119637Z test broker::tests::output_log_tap_reads_bytes_since_snapshot ... ok
2026-07-31T04:02:17.9121308Z test broker::tests::pair_hold_lifecycle_decisions ... ok
2026-07-31T04:02:17.9122560Z test broker::tests::rc_input_fence_scopes_to_rc_minted_non_controller_input_only ... ok
2026-07-31T04:02:17.9212357Z test broker::tests::read_translation_command_none_when_absent ... ok
2026-07-31T04:02:17.9347212Z test broker::tests::read_translation_command_reads_declared ... ok
2026-07-31T04:02:17.9369404Z test broker::tests::reap_dead_controller_clears_a_finished_writer ... ok
2026-07-31T04:02:17.9377789Z test broker::tests::reap_dead_controller_leaves_a_live_writer_untouched ... ok
2026-07-31T04:02:17.9385706Z test broker::tests::reap_evicts_a_blocked_writer_not_only_an_exited_one ... ok
2026-07-31T04:02:17.9391726Z test broker::tests::recover_log_clamps_a_poisoned_torn_ring ... ok
2026-07-31T04:02:17.9394291Z test broker::tests::recover_reopens_a_poisoned_sessions_map ... ok
2026-07-31T04:02:17.9406969Z test broker::tests::revoked_incumbent_writer_emits_the_terminal_displaced ... ok
2026-07-31T04:02:17.9419853Z test broker::tests::same_identity_resubscribe_refuses_a_stale_generation ... ok
2026-07-31T04:02:17.9421454Z test broker::tests::select_endpoints_running_adapter_filters_dedups_sorts ... ok
2026-07-31T04:02:17.9423137Z test broker::tests::sessions_reply_resume_seq_defaults_when_absent ... ok
2026-07-31T04:02:17.9424584Z test broker::tests::should_settle_rearms_on_observable_pty ... ok
2026-07-31T04:02:17.9436460Z test broker::tests::stale_generation_detach_never_clears_the_newer_controller ... ok
2026-07-31T04:02:17.9792569Z test broker::tests::a_viewer_below_the_floor_gets_the_repaint_and_skip_to_live_stays_empty ... ok
2026-07-31T04:02:17.9810667Z test broker::tests::stalled_incumbent_is_evicted_on_reattach_and_control_released ... ok
2026-07-31T04:02:17.9812946Z test broker::tests::stamp_divergence_gates_writes ... ok
2026-07-31T04:02:18.0278225Z test broker::tests::stale_snapshot_stamp_write_refused_after_reap_generation_bump ... ok
2026-07-31T04:02:18.1396230Z test broker::tests::stamp_driven_by_latches_own_node_hex_verbatim_like_remote ... ok
2026-07-31T04:02:18.2107653Z test broker::tests::delivery_is_suppressed_during_a_transition_and_one_sync_frame_substitutes ... ok
2026-07-31T04:02:18.2937415Z test brainproc::tests::planned_restart_respawns_with_update_reason ... ok
2026-07-31T04:02:18.3492204Z test broker::tests::taking_the_engine_rooms_controls_costs_a_member_or_admin_code ... ok
2026-07-31T04:02:18.3496822Z test broker::tests::the_suppressed_window_is_exempt_from_the_controller_eviction_deadline ... ok
2026-07-31T04:02:18.3507191Z test broker::tests::tracked_state_inside_the_window_surfaces_in_the_sync_frame ... ok
2026-07-31T04:02:18.3512700Z test broker::tests::untracked_toggles_defer_into_the_sync_frame_and_hyperlinks_drop ... ok
2026-07-31T04:02:18.3514217Z test broker::tests::viewer_overflow_or_disconnect_evicts_never_blocks ... ok
2026-07-31T04:02:18.4424491Z test broker::tests::superseded_controller_writer_is_epoch_gated_silent_one_live_writer_per_conn ... ok
2026-07-31T04:02:18.4425328Z test broker::tests::wake_gate_decision_truth_table ... ok
2026-07-31T04:02:18.4561879Z test broker::tests::the_engine_room_refuses_every_viewport_and_every_off_node_attach ... ok
2026-07-31T04:02:18.4563139Z test broker::tests::wrapper_alive_prefers_the_table_and_falls_back_where_there_is_none ... ok
2026-07-31T04:02:18.4564185Z test broker::tests::zombie_verdict_table ... ok
2026-07-31T04:02:18.4566348Z test codec::tests::back_to_back_frames_decode_independently ... ok
2026-07-31T04:02:18.4568281Z test codec::tests::frame_round_trips_through_buffer ... ok
2026-07-31T04:02:18.4569522Z test codec::tests::oversized_prefix_rejected ... ok
2026-07-31T04:02:18.4660769Z test config::tests::auto_suspend_knob_is_opt_in_default_off ... ok
2026-07-31T04:02:18.4734696Z test config::tests::crash_grace_is_config_driven ... ok
2026-07-31T04:02:18.4812250Z test config::tests::detached_subnets_knob_defaults_empty ... ok
2026-07-31T04:02:18.4875527Z test config::tests::full_auto_update_is_gated_by_default ... ok
2026-07-31T04:02:18.4948081Z test config::tests::malformed_file_degrades_to_default ... ok
2026-07-31T04:02:18.4954290Z test config::tests::missing_file_is_default ... ok
2026-07-31T04:02:18.5022617Z test config::tests::pulse_period_is_config_driven ... ok
2026-07-31T04:02:18.5151773Z test brainproc::tests::exe_hash_computed_exactly_once_across_n_publishes ... ok
2026-07-31T04:02:18.5224611Z test config::tests::relay_choice_is_config_driven ... ok
2026-07-31T04:02:18.5233031Z test config::tests::save_load_roundtrip ... ok
2026-07-31T04:02:18.5339645Z test config::tests::startup_endpoints_roundtrip ... ok
2026-07-31T04:02:18.5344296Z test conn::tests::conn_ids_are_unique_and_labels_stay_bounded ... ok
2026-07-31T04:02:18.5348555Z test conn::tests::organic_write_failure_still_poisons_and_is_not_the_timeout_class ... ok
2026-07-31T04:02:18.5352414Z test conn::tests::retirement_token_splits_deadline_from_organic_with_attribution_parity ... ok
2026-07-31T04:02:18.5353693Z test consent::tests::decide_honors_full_auto_flag ... ok
2026-07-31T04:02:18.5464340Z test config::tests::upsert_startup_endpoint_appends_then_replaces_preserving_other_knobs ... ok
2026-07-31T04:02:18.5904226Z test consent::tests::no_live_session_resolves_to_none ... ok
2026-07-31T04:02:18.6042901Z test crc_swap::tests::apply_rollback_never_strands ... ok
2026-07-31T04:02:18.6272512Z test crc_swap::tests::apply_swaps_changed_creates_new_untouched_identical ... ok
2026-07-31T04:02:18.6365391Z test crc_swap::tests::crash_recovery_missing_target_keeps_last_good_old ... ok
2026-07-31T04:02:18.6421745Z test crc_swap::tests::displace_picks_fresh_old_name_and_gc_sweeps_stale ... ok
2026-07-31T04:02:18.6720333Z test consent::tests::resolves_most_recently_active_live_session ... ok
2026-07-31T04:02:18.6807348Z test crc_swap::tests::plan_recurses_nested_dirs ... ok
2026-07-31T04:02:18.6910535Z test crc_swap::tests::plan_selects_only_changed ... ok
2026-07-31T04:02:18.6946327Z test crc_swap::tests::swap_error_carries_op_and_paths ... ok
2026-07-31T04:02:18.7715615Z test brainproc::tests::ready_but_wrong_bytes_rolls_back_never_promotes ... ok
2026-07-31T04:02:19.2365490Z test daemon::tests::a_captured_spawn_inherits_only_the_handle_in_its_allowlist ... ok
2026-07-31T04:02:19.3821249Z test brainproc::tests::clear_before_spawn_defeats_exact_generation_stale_file ... ok
2026-07-31T04:02:20.3589448Z test broker::tests::viewer_writer_emits_evicted_marker_only_on_an_evicted_close ... ok
2026-07-31T04:02:20.4378074Z test brainproc::tests::ready_but_old_gen_never_drains_does_not_promote_rolls_back ... ok
2026-07-31T04:02:20.4379515Z test daemon::tests::drive_ladder_all_err_returns_last_err ... ok
2026-07-31T04:02:20.4380826Z test daemon::tests::drive_ladder_falls_through_to_next_rung_on_err ... ok
2026-07-31T04:02:20.4382016Z test daemon::tests::drive_ladder_picks_first_ok_rung ... ok
2026-07-31T04:02:20.4383286Z test daemon::tests::ensure_declines_only_against_a_standing_operator_stop ... ok
2026-07-31T04:02:20.4462636Z test daemon::tests::a_scrubbed_variable_never_reaches_the_child ... ok
2026-07-31T04:02:20.4652764Z test brainproc::tests::ready_candidate_promotes_once_old_gen_drains ... ok
2026-07-31T04:02:20.4774331Z test daemon::tests::launch_ladder_order_is_wmi_schtasks_breakaway_injob ... ok
2026-07-31T04:02:20.5067006Z test daemon::tests::net_retry_backoff_doubles_then_caps ... ok
2026-07-31T04:02:20.5067845Z test brainproc::tests::ready_with_matching_bytes_promotes ... ok
2026-07-31T04:02:20.5575069Z test daemon::tests::null_std_handles_only_on_a_pipe_stderr ... ok
2026-07-31T04:02:20.5584720Z test daemon::tests::the_refusal_line_names_the_remedy ... ok
2026-07-31T04:02:20.5590639Z test daemon::tests::windows_arg_quoting_roundtrips_the_rules ... ok
2026-07-31T04:02:20.5606795Z test daemon::tests::wmi_create_script_carries_the_no_window_startup_spec ... ok
2026-07-31T04:02:20.5608520Z test deadline::tests::advance_after_fire_steps_one_grid_normally_and_collapses_a_stall ... ok
2026-07-31T04:02:20.6165441Z test daemon::tests::a_tree_teardown_reaches_a_grandchild_the_service_spawned ... ok
2026-07-31T04:02:20.7476830Z test brainproc::tests::trial_promotes_on_ready_then_supervises_the_accepted_binary ... ok
2026-07-31T04:02:20.7909990Z test daemon::tests::spawn_env_additions_reach_the_child_and_keep_the_inherited_environment ... ok
2026-07-31T04:02:20.7910784Z test deadline::tests::next_fire_between_grid_points_rounds_up ... ok
2026-07-31T04:02:20.7911354Z test deadline::tests::next_fire_long_jump_collapses_missed_ticks_to_one ... ok
2026-07-31T04:02:20.7912698Z test deadline::tests::next_fire_on_grid_returns_now_and_advances_strictly ... ok
2026-07-31T04:02:20.7913446Z test deadline::tests::next_fire_saturates_when_now_precedes_anchor ... ok
2026-07-31T04:02:20.7917085Z test deadline::tests::one_shot_fires_at_or_after_target_and_never_resets ... ok
2026-07-31T04:02:20.8213756Z test broker::tests::supervised_worker_panic_faults_and_reaps_child ... ok
2026-07-31T04:02:20.9349250Z test daemon::tests::breakaway_spawn_escapes_a_kill_on_close_job ... ok
2026-07-31T04:02:20.9355607Z test deadline::tests::zero_interval_degrades_to_config_default ... ok
2026-07-31T04:02:20.9358599Z test deelevate::tests::env_overlay_keeps_explicit_spt_home_alive ... ok
2026-07-31T04:02:20.9360284Z test deelevate::tests::plan_spawn_deelevates_only_with_a_target ... ok
2026-07-31T04:02:20.9363658Z test digest::tests::common_prefix_len_finds_the_unchanged_head ... ok
2026-07-31T04:02:20.9461466Z test brainproc::tests::trial_kills_alive_never_ready_candidate_before_rollback ... ok
2026-07-31T04:02:20.9485819Z test brainproc::tests::stale_generation_minus_one_ready_never_promotes ... ok
2026-07-31T04:02:20.9511946Z test digest::tests::merge_by_ts_interleaves_context ... ok
2026-07-31T04:02:20.9526312Z test brainproc::tests::supervisor_owns_generation_and_stamps_start_reason ... ok
2026-07-31T04:02:20.9560996Z test brainproc::tests::supervisor_respawns_brain_until_stopped ... ok
2026-07-31T04:02:20.9562308Z test digest::tests::resolve_config_precedence ... ok
2026-07-31T04:02:20.9564798Z test digest::tests::supersede_collapses_cross_generation_replay_to_newest ... ok
2026-07-31T04:02:20.9566288Z test digest::tests::supersede_is_noop_on_disjoint_sessions ... ok
2026-07-31T04:02:20.9568747Z test digest::tests::supersede_keeps_within_generation_repeats ... ok
2026-07-31T04:02:20.9570424Z test digest::tests::supersede_trims_divider_around_emptied_middle_generation ... ok
2026-07-31T04:02:20.9572743Z test digesthub::tests::dropped_subscriber_is_pruned ... ok
2026-07-31T04:02:20.9574873Z test digesthub::tests::project_and_publish_stores_latest ... ok
2026-07-31T04:02:20.9576631Z test digesthub::tests::publish_delta_is_tail_then_full_refresh ... ok
2026-07-31T04:02:20.9580176Z test digesthub::tests::render_is_glanceable ... ok
2026-07-31T04:02:20.9581490Z test digesthub::tests::subscribe_returns_current_base ... ok
2026-07-31T04:02:20.9583909Z test dispatch::tests::breaker_trips_with_doubling_capped_window_and_resets_on_progress ... ok
2026-07-31T04:02:20.9585711Z test dispatch::tests::classifies_every_family_by_first_line_shape ... ok
2026-07-31T04:02:20.9587621Z test dispatch::tests::classify_failure_seat_blocked_is_exactly_the_three_discipline_strings ... ok
2026-07-31T04:02:20.9588902Z test dispatch::tests::cold_enumeration_claims_at_most_the_pool_bound_per_poll ... ok
2026-07-31T04:02:20.9591959Z test dispatch::tests::digest_pull_and_rest_never_read_as_each_other ... ok
2026-07-31T04:02:20.9593634Z test dispatch::tests::dispatch_event_carries_the_complete_key_set ... ok
2026-07-31T04:02:20.9595140Z test dispatch::tests::feed_accumulator_commits_per_bound_never_per_chunk ... ok
2026-07-31T04:02:20.9596869Z test dispatch::tests::finished_is_terminal_for_attach_only ... ok
2026-07-31T04:02:20.9599386Z test dispatch::tests::line_endpoint_resolves_each_family_identity_key ... ok
2026-07-31T04:02:20.9602019Z test dispatch::tests::oneway_seatblocked_strikes_out_terminal_while_request_reply_paces_forever ... ok
2026-07-31T04:02:20.9602991Z test dispatch::tests::only_the_old_broker_unknown_verb_answer_falls_back_to_the_peek ... ok
2026-07-31T04:02:20.9604378Z test dispatch::tests::seat_blocked_requeues_budget_free_paced_by_the_breaker_window ... ok
2026-07-31T04:02:20.9605989Z test dispatch::tests::transient_failure_requeues_bounded_and_terminal_never_reenters ... ok
2026-07-31T04:02:20.9607925Z test dispatch::tests::unknown_shapes_refuse_classification ... ok
2026-07-31T04:02:20.9609820Z test docshost::tests::content_types_cover_the_bundle_classes ... ok
2026-07-31T04:02:20.9612225Z test docshost::tests::port_resolution_env_config_default ... ok
2026-07-31T04:02:20.9615334Z test docshost::tests::sanitizer_admits_pages_and_rejects_escapes ... ok
2026-07-31T04:02:20.9618727Z test drivehub::tests::a_following_op_is_served_when_nothing_refused ... ok
2026-07-31T04:02:20.9629426Z test drivehub::tests::a_foreign_owlery_is_refused_pre_ack_under_its_own_name ... ok
2026-07-31T04:02:20.9631846Z test drivehub::tests::activity_and_drive_never_clobber_each_other ... ok
2026-07-31T04:02:20.9633737Z test drivehub::tests::activity_take_is_latest_wins_and_exactly_once ... ok
2026-07-31T04:02:20.9640184Z test drivehub::tests::an_unknown_op_hangs_up_instead_of_being_swallowed ... ok
2026-07-31T04:02:20.9668314Z test drivehub::tests::clear_evicts_both_classes ... ok
2026-07-31T04:02:20.9686883Z test drivehub::tests::clear_evicts_the_slot ... ok
2026-07-31T04:02:20.9689058Z test drivehub::tests::dead_generation_activity_frame_is_never_served ... ok
2026-07-31T04:02:20.9693056Z test drivehub::tests::dead_generation_frame_is_never_served ... ok
2026-07-31T04:02:20.9694343Z test drivehub::tests::drive_result_activity_key_is_additive_on_the_wire ... ok
2026-07-31T04:02:20.9697978Z test drivehub::tests::only_a_pre_ack_refusal_permits_a_second_spawn ... ok
2026-07-31T04:02:20.9700142Z test drivehub::tests::slots_are_per_owner ... ok
2026-07-31T04:02:20.9701737Z test drivehub::tests::take_is_exactly_once ... ok
2026-07-31T04:02:20.9703746Z test drivehub::tests::the_launch_reply_shapes_round_trip ... ok
2026-07-31T04:02:20.9718742Z test broker::tests::windows_session_is_zombie_sees_a_handle_held_corpse_as_dead ... ok
2026-07-31T04:02:20.9721099Z test drivehub::tests::write_is_latest_wins ... ok
2026-07-31T04:02:22.0525046Z test drivehub::tests::the_pre_ack_causes_are_three_distinct_diagnostics ... ok
2026-07-31T04:02:22.0645175Z test crc_swap::tests::mapped_old_does_not_brick_apply_displaces_aside ... ok
2026-07-31T04:02:22.0695281Z test daemon::tests::implicit_ensure_declines_without_clearing_the_inhibit ... ok
2026-07-31T04:02:22.0696530Z test daemon::tests::detached_no_inherit_falls_back_under_a_breakaway_denying_job ... ok
2026-07-31T04:02:22.0715864Z test effect::tests::apply_once_does_not_hold_the_journal_lock_across_effect ... ok
2026-07-31T04:02:22.0717291Z test effect::tests::marker_is_single_source_and_frozen ... ok
2026-07-31T04:02:22.0724588Z test effect::tests::minter_tag_round_trips ... ok
2026-07-31T04:02:22.0767757Z test effect::tests::open_creates_missing_parent_dirs ... ok
2026-07-31T04:02:22.0867002Z test effect::tests::applied_set_survives_reopen ... ok
2026-07-31T04:02:22.1162905Z test effect::tests::poisoned_journal_lock_still_applies_subsequent_ops ... ok
2026-07-31T04:02:22.1214341Z test effect::tests::failed_effect_is_not_recorded_applied ... ok
2026-07-31T04:02:22.1228200Z test effect::tests::second_apply_for_same_key_is_deduped ... ok
2026-07-31T04:02:22.1352656Z test effect::tests::ptywrite_skips_the_durable_journal_write_while_netsend_persists ... ok
2026-07-31T04:02:22.1354242Z test effect::tests::with_tracing_retry_no_retry_on_success ... ok
2026-07-31T04:02:22.1356021Z test effect::tests::with_tracing_retry_passes_through_other_errors ... ok
2026-07-31T04:02:22.1357917Z test effect::tests::with_tracing_retry_retries_once_on_no_longer_held ... ok
2026-07-31T04:02:22.1359405Z test effect::tests::with_tracing_retry_terminal_is_public_language ... ok
2026-07-31T04:02:22.1361564Z test frame::tests::envelope_with_unknown_trailing_field_decodes_on_older_peer ... ok
2026-07-31T04:02:22.1363149Z test frame::tests::handshake_accepts_newer_brain_on_older_broker ... ok
2026-07-31T04:02:22.1364377Z test frame::tests::handshake_rejects_below_floor ... ok
2026-07-31T04:02:22.1365653Z test frame::tests::handshake_rejects_role_mismatch ... ok
2026-07-31T04:02:22.1367570Z test frame::tests::unknown_kind_is_not_a_decode_error ... ok
2026-07-31T04:02:22.1369202Z test grants::tests::escalation_answers_apply ... ok
2026-07-31T04:02:22.1371266Z test grants::tests::escalation_ask_body_roundtrip ... ok
2026-07-31T04:02:22.1505729Z test effect::tests::recover_is_migration_free ... ok
2026-07-31T04:02:22.1507495Z test grants::tests::no_session_escalates_with_none_target ... ok
2026-07-31T04:02:22.1509125Z test grants::tests::preconsent_flags_author_grants ... ok
2026-07-31T04:02:22.1510477Z test grants::tests::reserved_capabilities_refuse_even_when_granted ... ok
2026-07-31T04:02:22.1511929Z test grants::tests::ungranted_escalates_granted_allows ... ok
2026-07-31T04:02:22.1515735Z test harnesshost::tests::mint_session_id_is_fresh_hex ... ok
2026-07-31T04:02:22.1520623Z test harnesshost::tests::node_key_fills_advertised_label_in_session_template ... ok
2026-07-31T04:02:22.1524625Z test harnesshost::tests::node_missing_reference_fails_loud ... ok
2026-07-31T04:02:22.1529488Z test harnesshost::tests::prepare_fails_closed_on_wrong_kind_missing_role_and_bad_template ... ok
2026-07-31T04:02:22.1533813Z test harnesshost::tests::prepare_fills_env_inject_values_with_substitution ... ok
2026-07-31T04:02:22.1537676Z test harnesshost::tests::prepare_fills_id_and_session_into_self_command ... ok
2026-07-31T04:02:22.1540854Z test harnesshost::tests::prepare_resume_falls_back_to_self_when_no_resume_role ... ok
2026-07-31T04:02:22.1545041Z test harnesshost::tests::prepare_selects_resume_template_on_resume_else_self ... ok
2026-07-31T04:02:22.1552211Z test harnesshost::tests::prepare_threads_translation_binary_when_declared ... ok
2026-07-31T04:02:22.1556731Z test harnesshost::tests::provisional_session_id_recognizes_own_mint_only ... ok
2026-07-31T04:02:22.1659315Z test harnesshost::tests::translation_binary_resolves_against_install_dir ... ok
2026-07-31T04:02:22.1662581Z test effect::tests::shellchan_and_rc_same_session_dont_collide ... ok
2026-07-31T04:02:22.2114907Z test brainproc::tests::trial_rolls_back_after_budget_of_pre_ready_exits ... ok
2026-07-31T04:02:22.2381232Z test effect::tests::each_named_minter_namespaces_its_ops ... ok
2026-07-31T04:02:22.2705857Z test effect::tests::gauntlet_is_exactly_once_across_brain_crashes ... ok
2026-07-31T04:02:28.1140344Z test daemon::tests::is_running_tracks_the_seed_channel ... ok
2026-07-31T04:02:28.1235412Z test deadline::tests::cold_and_crash_write_fresh_anchor_at_now ... ok
2026-07-31T04:02:28.1306599Z test deadline::tests::corrupt_file_degrades_to_fresh ... ok
2026-07-31T04:02:28.1326912Z test deadline::tests::distinct_keys_do_not_cross_clobber ... ok
2026-07-31T04:02:28.1328301Z test lifecycle::tests::event_turn_timeout_floors_at_thirty_seconds ... ok
2026-07-31T04:02:28.1329552Z test lifecycle::tests::first_turn_psyche_context_is_never_empty ... ok
2026-07-31T04:02:28.1348811Z test deadline::tests::update_keeps_anchor_and_refreshes_interval ... ok
2026-07-31T04:02:28.1350172Z test lifecycle::tests::is_owlery_internal_cases ... ok
2026-07-31T04:02:28.1359738Z test deadline::tests::update_with_no_file_falls_back_fresh ... ok
2026-07-31T04:02:28.2605531Z test digest::tests::extractor_spans_sessions_with_a_boundary_marker ... ok
2026-07-31T04:02:28.2810230Z test digest::tests::log_less_two_origin_merge_interleaves_by_ts ... ok
2026-07-31T04:02:28.3002783Z test digest::tests::projects_a_log_less_endpoint_from_digest_log ... ok
2026-07-31T04:02:28.3013106Z test digest::tests::projects_empty_for_a_sourceless_endpoint ... ok
2026-07-31T04:02:28.3015151Z test lifecycle::tests::psyche_turn_keys_carry_custody_sids_and_context_file_path ... ok
2026-07-31T04:02:28.3016254Z test lifecycle::tests::psyche_turn_strikes_exhausted_boundary ... ok
2026-07-31T04:02:28.3079455Z test lifecycle::tests::psyche_context_file_continue_is_zero_bytes_fresh_is_nonempty ... ok
2026-07-31T04:02:28.4797674Z test grants::tests::escalation_notif_fires_to_most_recent_and_roundtrips ... ok
2026-07-31T04:02:28.6427561Z test inject::tests::has_parked_idle_spool_gates_on_idle_hosted_and_pending ... ok
2026-07-31T04:02:28.8154576Z test inject::tests::shared_inject_leg_detects_spt_hosted ... ok
2026-07-31T04:02:28.8444396Z test lifecycle::tests::base_keys_carries_single_subnet_no_home ... ok
2026-07-31T04:02:28.8838069Z test lifecycle::tests::crash_signoff_spares_recovered_self ... ok
2026-07-31T04:02:28.9221648Z test lifecycle::tests::crash_signoff_tears_down_when_still_gone ... ok
2026-07-31T04:02:28.9591127Z test lifecycle::tests::custody_survives_parent_boundary_and_reseed_clears ... ok
2026-07-31T04:02:29.0134349Z test lifecycle::tests::echo_fire_resolves_relative_commune_dir_against_endpoint_cwd ... ok
2026-07-31T04:02:29.0291338Z test lifecycle::tests::echo_fire_skips_loud_on_relative_dir_without_cwd ... ok
2026-07-31T04:02:29.0575138Z test lifecycle::tests::harness_owner_gone_anchors_on_parent_pid ... ok
2026-07-31T04:02:29.0576709Z test lifecycle::tests::resolve_endpoint_drop_dir_cases ... ok
2026-07-31T04:02:29.0601692Z test lifecycle::tests::manifest_cell_refresh_swaps_manifest_and_runtime ... ok
2026-07-31T04:02:29.0615362Z test lifecycle::tests::node_key_fills_advertised_label_in_lifecycle_base_keys ... ok
2026-07-31T04:02:29.1562590Z test lifecycle::tests::orphan_watch_fires_on_dead_owner ... ok
2026-07-31T04:02:29.1563670Z test lifecycle::tests::session_not_found_discriminates_reseed_from_strike ... ok
2026-07-31T04:02:29.1661716Z test lifecycle::tests::orphan_watch_honors_stop_for_live_owner ... ok
2026-07-31T04:02:29.2700914Z test lifecycle::tests::psyche_turn_threads_parent_read_env_into_spawn ... ok
2026-07-31T04:02:29.3028560Z test lifecycle::tests::pulse_loop_does_not_write_anchor_per_fire ... ok
2026-07-31T04:02:29.3353443Z test lifecycle::tests::pulse_loop_is_config_paced_and_killable ... ok
2026-07-31T04:02:29.3357547Z test linkhost::tests::per_capability_act_gate_blocks_until_class_scoped_grant ... ok
2026-07-31T04:02:29.3939755Z test lifecycle::tests::pulse_loop_update_preserves_phase_crash_rebases ... ok
2026-07-31T04:02:29.4451234Z test lifecycle::tests::pulse_recency_and_auto_suspend_follow_resting_state ... ok
2026-07-31T04:02:34.0248554Z test lifecycle::tests::pulse_tick_ingests_drop ... ok
2026-07-31T04:02:39.2150144Z test lifecycle::tests::relative_commune_dir_resolves_against_endpoint_cwd_and_fills_project_branch ... ok
2026-07-31T04:02:39.2295879Z test lifecycle::tests::reload_fires_on_disk_change ... ok
2026-07-31T04:02:39.2493569Z test lifecycle::tests::reload_keeps_last_good_on_unparseable ... ok
2026-07-31T04:02:39.2568485Z test lifecycle::tests::reload_noop_when_unchanged ... ok
2026-07-31T04:02:39.2581889Z test lifecycle::tests::reload_noop_without_install_dir ... ok
2026-07-31T04:02:39.2583349Z test livehost::tests::decide_resume_goal_table ... ok
2026-07-31T04:02:39.5521102Z test lifecycle::tests::rest_edge_echo_success_clears_stale_psyche_stamp ... ok
2026-07-31T04:02:39.5522334Z test livehost::tests::hybrid_self_heal_due_table ... ok
2026-07-31T04:02:40.1832432Z test livehost::tests::legacy_psyche_sweep_guard_is_id_specific_and_fail_safe ... ok
2026-07-31T04:02:40.2003518Z test livehost::tests::live_bin_gc_removes_own_copy_and_displaces_when_locked ... ok
2026-07-31T04:02:40.3159387Z test lifecycle::tests::rest_event_fires_echo_once_and_wake_resurfaces ... ok
2026-07-31T04:02:42.2378995Z test lifecycle::tests::role_less_manifest_ticks_strike_free ... ok
2026-07-31T04:02:42.3224283Z test lifecycle::tests::thrash_budget_trips_on_a_synthetic_failure_loop_without_touching_status ... ok
2026-07-31T04:02:42.3508106Z test lifecycle::tests::turn_budget_stamps_on_exhaustion_and_clears_on_success ... ok
2026-07-31T04:02:42.4677597Z test linkhost::tests::cmd_wakes_a_stale_online_persistent_instance ... ok
2026-07-31T04:02:42.5962227Z test linkhost::tests::gateway_typed_owner_resolves_and_drives_keyed_on_id_not_type ... ok
2026-07-31T04:02:42.6936615Z test linkhost::tests::prepare_drive_is_live_or_drop_and_never_spools ... ok
2026-07-31T04:02:42.7730930Z test linkhost::tests::relink_refuses_a_live_instance_but_recovers_a_stale_online_one ... ok
2026-07-31T04:02:42.8408598Z test linkhost::tests::run_action_drive_drops_offline_without_wake_or_spool ... ok
2026-07-31T04:02:43.0369179Z test linkhost::tests::run_action_refuses_gated_op_without_spooling ... ok
2026-07-31T04:02:43.1539327Z test linkhost::tests::run_action_relinks_drives_and_refuses ... ok
2026-07-31T04:02:43.2663699Z test livehost::tests::boot_gate_offlines_sessionless_controllable_then_reconcile_skips_host ... ok
2026-07-31T04:02:43.2664929Z test livehost::tests::reconcile_routing_controllable_falls_through_to_broker_session_truth ... ok
2026-07-31T04:02:43.3503193Z test livehost::tests::broker_failure_skips_the_pass_never_mass_offlines ... ok
2026-07-31T04:02:43.5357518Z test livehost::tests::control_reap_clears_sticky_controlled_on_already_offline_perch ... ok
2026-07-31T04:02:43.6270984Z test livehost::tests::fresh_brain_rehydrates_an_online_live_endpoint ... ok
2026-07-31T04:02:43.6271971Z test livehost::tests::restart_resume_gate_reruns_the_orphaned_controllable_dead_set_regardless_of_state ... ok
2026-07-31T04:02:43.7198941Z test livehost::tests::pull_liveness_demotes_a_relay_held_endpoint_instead_of_offlining_it ... ok
2026-07-31T04:02:43.7200783Z test machineid::tests::hash_is_domain_separated_and_stable ... ok
2026-07-31T04:02:44.0606641Z test livehost::tests::pull_liveness_marks_sessionless_spt_hosted_offline_only ... ok
2026-07-31T04:02:44.0608093Z test msg::tests::bytes_round_trip_through_payload ... ok
2026-07-31T04:02:44.0610383Z test msg::tests::endpoint_injected_envelope_carries_delivered_and_spool_hint ... ok
2026-07-31T04:02:44.0612335Z test msg::tests::endpoint_input_frames_round_trip ... ok
2026-07-31T04:02:44.0614151Z test msg::tests::evicted_envelope_round_trips ... ok
2026-07-31T04:02:44.0616207Z test msg::tests::input_req_absent_ack_defaults_true_n_minus_1_safe ... ok
2026-07-31T04:02:44.0618139Z test msg::tests::input_req_ack_false_round_trips_faithfully ... ok
2026-07-31T04:02:44.0620492Z test msg::tests::net_frames_round_trip_and_tolerate_unknown_fields ... ok
2026-07-31T04:02:44.0622214Z test msg::tests::output_envelope_round_trips ... ok
2026-07-31T04:02:44.0623863Z test msg::tests::output_sync_flag_defaults_absent_and_skips_when_false ... ok
2026-07-31T04:02:44.0625790Z test msg::tests::presence_event_round_trips_and_tolerates_future_kind ... ok
2026-07-31T04:02:44.0627289Z test msg::tests::spawn_req_tolerates_unknown_field ... ok
2026-07-31T04:02:44.0629012Z test msg::tests::stream_lifetime_is_additive_and_defaults_durable ... ok
2026-07-31T04:02:44.0631066Z test msg::tests::two_phase_join_wire_round_trips ... ok
2026-07-31T04:02:44.0633069Z test msg::tests::wire_decodes_old_shape_to_legacy ... ok
2026-07-31T04:02:44.0691617Z test nethost::tests::append_halts_at_first_failed_write_removes_the_seat_and_cancels_the_lease ... ok
2026-07-31T04:02:44.0698229Z test nethost::tests::attach_replay_never_interleaves_with_concurrent_live_appends ... ok
2026-07-31T04:02:44.0705518Z test nethost::tests::begin_attach_refuses_only_while_a_poisoned_prior_still_drains ... ok
2026-07-31T04:02:44.2745303Z test nethost::tests::bounded_block_on_cuts_a_never_completing_op_with_an_ordinary_error ... ok
2026-07-31T04:02:44.3918654Z test livehost::tests::pull_reconcile_offlines_perch_when_broker_session_dies ... ok
2026-07-31T04:02:44.4214795Z test nethost::tests::dispatch_stream_infos_excludes_local_and_retired_rows_server_side ... ok
2026-07-31T04:02:44.4272224Z test nethost::tests::displaced_writer_failure_never_cancels_the_successor_lease ... ok
2026-07-31T04:02:44.4344295Z test nethost::tests::finish_halts_and_removes_a_poisoned_seat ... ok
2026-07-31T04:02:44.4654406Z test nethost::tests::conn_close_sweeps_its_stream_rows ... ok
2026-07-31T04:02:44.4673415Z test livehost::tests::reconcile_attempts_resume_for_a_registered_woken_endpoint ... ok
2026-07-31T04:02:44.4979148Z test nethost::tests::host_binds_endpoint_to_node_identity ... ok
2026-07-31T04:02:44.4981393Z test nethost::tests::next_seq_counts_appends_not_logical_chunks ... ok
2026-07-31T04:02:44.5036140Z test nethost::tests::loopback_conn_is_a_reused_singleton_that_cross_wires_a_stream_pair ... ok
2026-07-31T04:02:44.5331151Z test nethost::tests::open_class_routes_to_the_opener_row_only ... ok
2026-07-31T04:02:44.5335933Z test nethost::tests::opener_capture_gives_up_bounded_on_a_newline_less_stream ... ok
2026-07-31T04:02:44.5337833Z test nethost::tests::opener_pins_first_line_across_full_ring_roll ... ok
2026-07-31T04:02:44.5338711Z test nethost::tests::op_maps_are_minter_namespaced ... ok
2026-07-31T04:02:44.5410469Z test nethost::tests::presence_log_mirrors_the_seat_discipline ... ok
2026-07-31T04:02:44.5415320Z test nethost::tests::retentive_log_is_lossless_ordered_while_ordinary_log_overwrites ... ok
2026-07-31T04:02:44.5444988Z test nethost::tests::overflow_detaches_without_lease_cancel_and_the_brain_resumes_from_cursor ... ok
2026-07-31T04:02:44.5648242Z test nethost::tests::retire_hides_the_row_while_active_rows_stay ... ok
2026-07-31T04:02:44.5748825Z test nethost::tests::retire_sweep_dismisses_the_seat_and_terminal_retire_drops_the_row ... ok
2026-07-31T04:02:44.5905507Z test nethost::tests::send_stream_refuses_on_a_canceled_lease ... ok
2026-07-31T04:02:44.5949841Z test nethost::tests::retired_row_still_flushes_a_late_reply ... ok
2026-07-31T04:02:44.6223902Z test nethost::tests::unsubscribe_releases_only_the_callers_seat_joins_writer_and_is_idempotent ... ok
2026-07-31T04:02:44.6629921Z test nethost::tests::two_hosts_dial_over_loopback ... ok
2026-07-31T04:02:44.7796671Z test livehost::tests::reconcile_converges_a_dead_relay_and_spares_a_live_or_unproven_one ... ok
2026-07-31T04:02:44.8481975Z test livehost::tests::reconcile_does_not_double_host ... ok
2026-07-31T04:02:44.9219479Z test livehost::tests::reconcile_hosts_an_online_live_endpoint_and_drives_its_pulse ... ok
2026-07-31T04:02:44.9730111Z test livehost::tests::reconcile_keeps_driver_on_transient_read_fail_unhosts_on_dir_gone ... ok
2026-07-31T04:02:45.0256859Z test livehost::tests::reconcile_leaves_a_genuinely_suspended_endpoint_alone ... ok
2026-07-31T04:02:45.1588433Z test livehost::tests::reconcile_marks_unbound_skeleton_offline_on_session_death ... ok
2026-07-31T04:02:45.3471934Z test livehost::tests::reconcile_reaps_orphaned_worker_and_spares_live_parent ... ok
2026-07-31T04:02:45.3877863Z test livehost::tests::reconcile_refuses_a_woken_endpoint_with_an_unregistered_adapter ... ok
2026-07-31T04:02:45.4128992Z test livehost::tests::reconcile_skips_a_woken_endpoint_with_no_ledger_row ... ok
2026-07-31T04:02:45.4430802Z test livehost::tests::reconcile_skips_an_offline_live_endpoint ... ok
2026-07-31T04:02:45.4975218Z test livehost::tests::reconcile_unhosts_on_offline_transition ... ok
2026-07-31T04:02:45.5527787Z test nethost::tests::loopback_tunnel_backpressures_without_loss ... ok
2026-07-31T04:02:45.9873075Z test notif::tests::notif_command_renders_all_keys_and_is_opt_in ... ok
2026-07-31T04:02:46.3131208Z test livehost::tests::split_cleanup_clears_all_three_stamps_on_state_quirk_rows ... ok
2026-07-31T04:02:46.3132676Z test notifgate::tests::an_unvalidatable_notify_passes ... ok
2026-07-31T04:02:46.3134564Z test notifgate::tests::distinct_notifs_both_deliver ... ok
2026-07-31T04:02:46.3136756Z test machineid::tests::machine_id_hash_resolves_and_is_stable ... ok
2026-07-31T04:02:46.3138776Z test notifgate::tests::the_validity_gate_decision_table ... ok
2026-07-31T04:02:46.3154418Z test notifgate::tests::retain_preserves_order_of_the_survivors ... ok
2026-07-31T04:02:46.5450748Z test notifsync::tests::feed_converges_two_stores_and_dismiss_replicates ... ok
2026-07-31T04:02:46.5518262Z test notifsync::tests::concurrent_dismiss_and_surface_commute_across_the_feed ... ok
2026-07-31T04:02:46.6436308Z test notif::tests::consent_decision_produces_notif_only_when_gated ... ok
2026-07-31T04:02:46.7445280Z test notifsync::tests::non_member_subnet_record_never_materializes ... ok
2026-07-31T04:02:46.7446766Z test pairhost::tests::a_re_postured_subnet_advises_and_never_applies ... ok
2026-07-31T04:02:46.7496982Z test notifsync::tests::node_scoped_rows_are_excluded_from_the_feed ... ok
2026-07-31T04:02:46.7498491Z test pairhost::tests::joiner_clock_render_shows_step_offset_and_state ... ok
2026-07-31T04:02:46.7500086Z test pairhost::tests::meet_failure_detail_concise_vs_verbose ... ok
2026-07-31T04:02:46.7503119Z test pairhost::tests::meet_final_retry_failing_surrenders_once ... ok
2026-07-31T04:02:46.7505361Z test pairhost::tests::meet_retries_once_after_refresh_on_exhaustion ... ok
2026-07-31T04:02:46.7506946Z test pairhost::tests::the_advisory_says_nothing_was_applied ... ok
2026-07-31T04:02:46.7508251Z test pairhost::tests::wire_errors_classify_for_the_guided_ux ... ok
2026-07-31T04:02:46.7967278Z test presence::tests::mra_degrades_to_local_and_skips_noise_rows ... ok
2026-07-31T04:02:46.8464404Z test notifsync::tests::untrusted_and_cross_subnet_origins_are_dropped ... ok
2026-07-31T04:02:46.8477550Z test presence::tests::mra_joins_local_and_gossiped_legs_under_one_max ... ok
2026-07-31T04:02:46.8545007Z test presence::tests::snapshot_loading_degrades_on_junk ... ok
2026-07-31T04:02:46.9167247Z test presence::tests::subnet_scope_gates_both_legs ... ok
2026-07-31T04:02:46.9415971Z test projwriter::tests::cold_construct_spawns_no_git_and_first_cycle_publishes ... ok
2026-07-31T04:02:46.9417103Z test notif::tests::expired_row_is_auto_dismissed_at_boundary_not_surfaced ... ok
2026-07-31T04:02:46.9733411Z test projwriter::tests::corrupt_index_is_repaired_and_counted ... ok
2026-07-31T04:02:47.1066515Z test notif::tests::first_fire_declines_an_already_expired_row ... ok
2026-07-31T04:02:47.3254693Z test notif::tests::first_fire_reaches_most_recent_visible_endpoint ... ok
2026-07-31T04:02:47.5140712Z test notif::tests::first_fire_redirects_to_a_fresher_remote_winner_unmarked ... ok
2026-07-31T04:02:47.7267795Z test notif::tests::first_fire_rides_the_quiet_window_not_the_live_stream ... ok
2026-07-31T04:02:47.8658825Z test notif::tests::hidden_endpoint_boundary_surfaces_nothing ... ok
2026-07-31T04:02:48.1039553Z test notif::tests::hidden_endpoint_is_never_the_target ... ok
2026-07-31T04:02:48.1041014Z test propagate::tests::classifier_maps_every_status_shape ... ok
2026-07-31T04:02:48.2118335Z test notif::tests::no_live_endpoint_is_a_typed_no_target ... ok
2026-07-31T04:02:48.3801390Z test notif::tests::node_scoped_first_fire_ignores_a_fresher_remote_winner ... ok
2026-07-31T04:02:48.6700532Z test notif::tests::resurface_delivers_undismissed_with_gates ... ok
2026-07-31T04:02:48.9329008Z test notif::tests::rollback_notif_is_loud_and_resurfaces ... ok
2026-07-31T04:02:50.2066847Z test notif::tests::shell_notif_templates_render_for_attached_instances_only ... ok
2026-07-31T04:02:50.4686288Z test notif::tests::suppression_window_holds_cross_endpoint ... ok
2026-07-31T04:02:50.5253164Z test pairhost::tests::an_advisory_records_the_sighting_and_still_applies_nothing ... ok
2026-07-31T04:02:51.9469282Z test projwriter::tests::cwd_invalidation_evicts_shared_cache_entry ... ok
2026-07-31T04:02:51.9499502Z test pump::health::tests::degraded_on_all_peer_failure_healthy_only_on_real_progress ... ok
2026-07-31T04:02:52.4568962Z test pump::health::tests::health_file_roundtrip_and_degrade ... ok
2026-07-31T04:02:52.7185515Z test pump::health::tests::registry_admit_stamp_survives_restart_rounds_and_never_regresses ... ok
2026-07-31T04:02:52.7192533Z test pump::health::tests::stage_parses_from_attributed_reasons ... ok
2026-07-31T04:02:54.6684447Z test projwriter::tests::ordinary_commit_is_noop_config_change_rederives ... ok
2026-07-31T04:02:57.1197323Z test projwriter::tests::writer_thread_debounces_burst_into_one_cycle ... ok
2026-07-31T04:02:57.4404671Z test psyrelay::tests::empty_and_oversize_bodies_drop_typed ... ok
2026-07-31T04:02:57.5207690Z test pump::registry::tests::fire_due_rotations_rotates_due_and_leaves_pending ... ok
2026-07-31T04:02:57.5217229Z test pump::registry::tests::poll_wake_takes_the_advertise_marker_exactly_once ... ok
2026-07-31T04:02:57.8006518Z test psyrelay::tests::notify_reaches_own_user_only ... FAILED
2026-07-31T04:02:57.8013766Z test pump::tests::choreography_fan_targets_skips_detached_and_self ... ok
2026-07-31T04:02:57.8015518Z test pump::tests::choreography_first_tick_primes_all_legs ... ok
2026-07-31T04:02:57.8017044Z test pump::tests::choreography_mark_after_round_stamps_only_due ... ok
2026-07-31T04:02:57.8018709Z test pump::tests::choreography_peer_step_aborts_on_first_failure ... ok
2026-07-31T04:02:57.8020522Z test pump::tests::choreography_pre_round_once_and_before_any_peer_step ... ok
2026-07-31T04:02:57.8022037Z test pump::tests::choreography_wake_forces_only_that_worker ... ok
2026-07-31T04:02:57.8024058Z test pump::tests::drain_read_classifies_dead_carrier_as_restart_timeout_as_quiet ... ok
2026-07-31T04:02:57.8025882Z test pump::tests::first_tick_is_due_and_never_underflows ... ok
2026-07-31T04:02:57.8322240Z test pump::tests::heartbeat_writes_and_advances ... ok
2026-07-31T04:02:57.8324594Z test pump::tests::peer_leg_outcome_isolates_ordinary_backs_off_carrier_timeout_still_poisons ... ok
2026-07-31T04:02:57.8326457Z test pump::tests::per_peer_backoff_doubles_caps_and_eligibility ... ok
2026-07-31T04:02:57.8333759Z test pump::tests::presence_state_effect_correlates_and_isolates ... ok
2026-07-31T04:02:57.8711487Z test pump::tests::push_feed_retires_its_own_row_after_successful_fin ... ok
2026-07-31T04:02:57.8713021Z test pump::tests::push_target_is_the_full_roster_minus_self_and_tombstoned ... ok
2026-07-31T04:02:57.8864106Z test pump::tests::resolve_submit_addr_walks_the_route_chain ... ok
2026-07-31T04:02:57.9103345Z test pump::tests::startup_reconcile_heals_suspect_rows_and_migrates_invalid_ones ... ok
2026-07-31T04:02:57.9106823Z test pump::tests::supervisor_backoff_doubles_caps_and_resets ... ok
2026-07-31T04:02:57.9418156Z test pump::tests::supervisor_restarts_a_panicking_pump_until_stop ... ok
2026-07-31T04:02:57.9420141Z test pump::tests::wake_forces_a_round_regardless_of_cadence ... ok
2026-07-31T04:02:57.9426343Z test pump::update::tests::advertised_version_finds_dotted_tokens_and_refuses_counter_shapes ... ok
2026-07-31T04:02:57.9430360Z test pump::update::tests::the_retire_predicate_keeps_ahead_and_unparseable_rows ... ok
2026-07-31T04:02:57.9433210Z test pump::update::tests::version_ge_compares_dotted_versions_and_rejects_garbage ... ok
2026-07-31T04:02:58.0558818Z test psyrelay::tests::notify_without_live_endpoint_is_pending ... ok
2026-07-31T04:02:58.0559839Z test reap::tests::reap_without_enroll_is_noop ... ok
2026-07-31T04:02:58.0561348Z test reconcile::tests::active_node_wins ... ok
2026-07-31T04:02:58.0562887Z test reconcile::tests::double_active_tiebreaks_deterministically ... ok
2026-07-31T04:02:58.0564468Z test reconcile::tests::fallback_lowest_non_offline ... ok
2026-07-31T04:02:58.0566502Z test reconcile::tests::no_rows_reconciles_locally ... ok
2026-07-31T04:02:58.0905945Z test registryhost::tests::admitted_feeds_stamp_the_heard_map ... ok
2026-07-31T04:02:58.3159502Z test projwriter::tests::failed_cycle_preserves_last_known_good ... ok
2026-07-31T04:02:58.3362397Z test projwriter::tests::endpoint_events_patch_rows_and_drop_purged ... ok
2026-07-31T04:02:58.3408992Z test psyrelay::tests::null_stdout_driver_fails_the_guard ... ok
2026-07-31T04:02:58.3732452Z test projwriter::tests::warm_start_unchanged_generation_scans_nothing ... ok
2026-07-31T04:02:58.7057124Z test psyrelay::tests::prose_only_relays_nothing ... ok
2026-07-31T04:02:58.9396688Z test psyrelay::tests::reply_relays_to_inbound_sender ... ok
2026-07-31T04:02:59.1648237Z test psyrelay::tests::reply_without_target_is_dropped ... ok
2026-07-31T04:02:59.1912966Z test registryhost::tests::apply_feed_batch_writes_snapshots_once_with_per_kind_semantics_parity ... ok
2026-07-31T04:02:59.2155071Z test registryhost::tests::apply_feed_flips_only_on_observed_transition_to_active ... ok
2026-07-31T04:02:59.2239270Z test registryhost::tests::apply_feed_gates_and_merges_under_the_lease ... ok
2026-07-31T04:02:59.2458687Z test registryhost::tests::apply_node_labels_gates_and_merges ... ok
2026-07-31T04:02:59.2652273Z test reap::tests::job_reaps_enrolled_child_and_grandchild ... ok
2026-07-31T04:02:59.2762510Z test registryhost::tests::evict_aged_offline_rows_reaps_ghosts_and_rewrites_snapshots ... ok
2026-07-31T04:02:59.2906595Z test registryhost::tests::evict_silent_peers_drops_unheard_rows_and_rewrites_snapshots ... ok
2026-07-31T04:02:59.5228781Z test psyrelay::tests::spoofed_routing_is_stripped_and_restamped ... ok
2026-07-31T04:02:59.5230132Z test registryhost::tests::gossip_controller_node_covers_any_controller ... ok
2026-07-31T04:02:59.5233188Z test registryhost::tests::recent_projects_cap_fires_on_output_length_not_scanned_rows ... ok
2026-07-31T04:02:59.5235374Z test registryhost::tests::recent_projects_derive_once_per_distinct_cwd ... ok
2026-07-31T04:02:59.5290135Z test pump::registry::tests::disclosable_lines_keeps_the_per_subnet_filter ... ok
2026-07-31T04:02:59.5581184Z test pump::registry::tests::disclosable_lines_pushes_the_engine_room_only_to_its_chosen_viewer ... ok
2026-07-31T04:02:59.5591277Z test registryhost::tests::superseded_requires_label_and_machine_id_under_other_key ... ok
2026-07-31T04:02:59.5591857Z test registryhost::tests::repair_evict_tombstones_roster_snapshot_and_notices ... ok
2026-07-31T04:02:59.5649017Z test registryhost::tests::with_epoch_is_the_one_canonical_counter ... ok
2026-07-31T04:02:59.5698071Z test pump::registry::tests::discover_gate_filters_the_advert_push_per_viewer ... ok
2026-07-31T04:02:59.6838044Z test pump::registry::tests::pre_round_sweeps_and_refreshes_adverts_each_round ... ok
2026-07-31T04:02:59.7446232Z test registryhost::tests::advertise_local_scans_and_respects_visibility ... ok
2026-07-31T04:02:59.7794980Z test relcache::tests::applied_state_two_phase_round_trips_and_degrades ... ok
2026-07-31T04:02:59.7825716Z test registryhost::tests::advertise_local_stamps_the_node_label ... ok
2026-07-31T04:02:59.7932680Z test relcache::tests::partial_update_set_can_serve_held_platform_only ... ok
2026-07-31T04:02:59.7952646Z test relcache::tests::docs_bundle_stages_loads_and_clears_independently ... ok
2026-07-31T04:02:59.8059292Z test relcache::tests::single_platform_stamp_is_explicit_and_cleared_on_restage ... ok
2026-07-31T04:02:59.8112406Z test relcache::tests::stage_round_trips_and_restage_replaces ... ok
2026-07-31T04:02:59.8150611Z test registryhost::tests::advertised_status_ignores_host_error ... ok
2026-07-31T04:02:59.8152328Z test relcache::tests::torn_or_corrupt_stage_offers_nothing ... ok
2026-07-31T04:02:59.8166260Z test relcache::tests::update_set_round_trips_and_loads_by_platform ... ok
2026-07-31T04:02:59.8260131Z test release::tests::artifact_digest_mismatch_is_rejected ... ok
2026-07-31T04:02:59.8260628Z test release::tests::current_platform_is_registered_or_unknown ... ok
2026-07-31T04:02:59.8267048Z test release::tests::docs_entry_is_additive_and_verifies_exact_bytes ... ok
2026-07-31T04:02:59.8271606Z test release::tests::channel_mismatch_is_rejected ... ok
2026-07-31T04:02:59.8274799Z test release::tests::hex_roundtrips ... ok
2026-07-31T04:02:59.8280628Z test release::tests::known_triples_project_the_registry ... ok
2026-07-31T04:02:59.8298543Z test release::tests::musl_platform_registered ... ok
2026-07-31T04:02:59.8324406Z test release::tests::builtin_keys_merge_and_revoke_under_file_overlay ... ok
2026-07-31T04:02:59.8388135Z test release::tests::expired_metadata_is_rejected ... ok
2026-07-31T04:02:59.8451016Z test release::tests::revoked_key_is_rejected ... ok
2026-07-31T04:02:59.8462908Z test release::tests::shipped_builtin_table_is_well_formed ... ok
2026-07-31T04:02:59.8481113Z test release::tests::production_policy_loads_fail_closed ... ok
2026-07-31T04:02:59.8596767Z test release::tests::tampered_metadata_fails_signature ... ok
2026-07-31T04:02:59.8599388Z test release::tests::untrusted_key_is_unknown ... ok
2026-07-31T04:02:59.8647579Z test release::tests::non_monotonic_version_is_rollback ... ok
2026-07-31T04:02:59.8732016Z test release::tests::update_set_artifact_mismatch_is_rejected ... ok
2026-07-31T04:02:59.8837418Z test release::tests::update_set_missing_platform_is_typed_rejection ... ok
2026-07-31T04:02:59.8845957Z test release::tests::update_set_channel_and_rollback_gates_hold ... ok
2026-07-31T04:02:59.8900453Z test release::tests::update_set_tampering_breaks_whole_set_signature ... ok
2026-07-31T04:02:59.8970619Z test release::tests::update_set_verifies_and_selects_platform_artifact ... ok
2026-07-31T04:02:59.8988495Z test release::tests::valid_release_verifies_and_artifact_matches ... ok
2026-07-31T04:02:59.9230396Z test release::tests::verify_detached_signs_raw_artifact_bytes ... ok
2026-07-31T04:02:59.9370139Z test registryhost::tests::advertised_status_splits_unbound_warm_from_cold_suspended ... ok
2026-07-31T04:02:59.9375151Z test resting::tests::apply_event_miss_message_is_single_sourced ... ok
2026-07-31T04:02:59.9549868Z test resting::tests::apply_event_echo_failure_is_loud_but_state_persists ... ok
2026-07-31T04:02:59.9839023Z test resting::tests::apply_event_no_spurious_echo_on_cold_void_suspend ... ok
2026-07-31T04:02:59.9839706Z test resting::tests::auto_suspend_counts_from_dormancy_onset_and_is_opt_in ... ok
2026-07-31T04:03:00.0299684Z test resting::tests::apply_event_fires_echo_once_per_rest_edge_and_wake_on_wake ... ok
2026-07-31T04:03:00.0314706Z test resting::tests::apply_event_wakes_a_cold_void_perch ... ok
2026-07-31T04:03:00.0316746Z test resting::tests::effective_rest_state_table ... ok
2026-07-31T04:03:00.0342702Z test resting::tests::freshness_pull_marker_is_taken_exactly_once ... ok
2026-07-31T04:03:00.0343219Z test resting::tests::knob_chain_resolves_global_node_endpoint ... ok
2026-07-31T04:03:00.0449572Z test resting::tests::apply_event_auto_suspends_under_the_resolved_chain ... ok
2026-07-31T04:03:00.0547121Z test registryhost::tests::advertisement_carries_both_authored_blurb ... ok
2026-07-31T04:03:00.0549636Z test resting::tests::route_rest_event_contract_table ... ok
2026-07-31T04:03:00.1098583Z test resting::tests::suspend_with_broker_liveness_hint_edges_instead_of_no_edge ... ok
2026-07-31T04:03:00.1100250Z test resting::tests::transition_table_matches_the_context_model ... ok
2026-07-31T04:03:00.1104009Z test rollback_compat::tests::pre_ready_durable_files_are_additive_and_n1_readable ... ok
2026-07-31T04:03:00.1246280Z test resting::tests::deferred_held_keys_on_the_durable_rest_record ... ok
2026-07-31T04:03:00.1257352Z test resting::tests::rest_record_round_trips_with_anchor_discipline ... ok
2026-07-31T04:03:00.1667469Z test registryhost::tests::advertisement_carries_the_presence_datum ... ok
2026-07-31T04:03:00.2828292Z test registryhost::tests::advertisement_follows_resting_transitions_epoch_bumped ... ok
2026-07-31T04:03:02.4652016Z test registryhost::tests::recent_projects_for_dedups_newest_first_excludes_owlery ... ok
2026-07-31T04:03:02.4717046Z test seedproofx::grace_tests::grade_truth_table ... ok
2026-07-31T04:03:02.4718240Z test seedproofx::grace_tests::seed_never_appears_in_roster_gossip ... ok
2026-07-31T04:03:02.4751168Z test seedproofx::grace_tests::seedxfer_frame_round_trips_and_rejects_malformed ... ok
2026-07-31T04:03:02.4751855Z test seedproofx::roster_tests::admin_seed_rides_as_prefixed_sibling_and_routes_to_its_own_seam ... ok
2026-07-31T04:03:02.4752445Z test seedproofx::roster_tests::empty_roster_frame_round_trips ... ok
2026-07-31T04:03:02.4849013Z test seedproofx::roster_tests::malformed_roster_frame_rejected ... ok
2026-07-31T04:03:02.4850969Z test seedproofx::roster_tests::reconcile_fills_absent_keeps_observed_and_skips_self ... ok
2026-07-31T04:03:02.4878380Z test seedproofx::roster_tests::reconcile_refuses_mismatch_and_repairs_invalid_rows ... ok
2026-07-31T04:03:02.4887163Z test seedproofx::roster_tests::reconcile_replaces_a_suspect_row_with_the_validated_roster_address ... ok
2026-07-31T04:03:02.4887836Z test seedproofx::roster_tests::roster_frame_round_trips ... ok
2026-07-31T04:03:06.3442538Z test seedmap::tests::take_absent_is_none ... ok
2026-07-31T04:03:06.3446471Z test service::tests::plan_start_prefers_service_then_spawn_idempotent ... ok
2026-07-31T04:03:06.3455069Z test service::tests::plan_stop_routes_managed_then_ipc_then_noop ... ok
2026-07-31T04:03:06.3458747Z test service::tests::run_refused_only_when_windows_and_vanishing ... ok
2026-07-31T04:03:06.3460841Z test service::tests::stale_bare_logon_action_classification ... ok
2026-07-31T04:03:06.7465761Z test registryhost::tests::evict_silent_peers_never_touches_own_rows ... ok
2026-07-31T04:03:06.9746225Z test projwriter::tests::parity_full_ordered_list_vs_legacy_oracle ... ok
2026-07-31T04:03:06.9749209Z test servicehost::tests::a_healthy_run_resets_the_fast_exit_counter ... ok
2026-07-31T04:03:07.0283081Z test registryhost::tests::the_engine_room_is_absent_from_the_advertisement_until_it_chooses_a_viewer ... ok
2026-07-31T04:03:07.2748115Z test relay::tests::relay_backlog_never_drains_active_only ... ok
2026-07-31T04:03:07.2750057Z test servicehost::tests::a_newer_daemons_status_row_degrades_instead_of_failing_the_whole_reply ... ok
2026-07-31T04:03:07.3133997Z test servicehost::tests::a_path_verified_orphan_is_reaped_and_confirmed_by_a_post_kill_read ... ok
2026-07-31T04:03:07.3514107Z test servicehost::tests::a_service_that_exits_instantly_latches_and_stops_relaunching ... ok
2026-07-31T04:03:07.6344218Z test relay::tests::respawn_loses_no_spooled_message ... ok
2026-07-31T04:03:09.1766948Z test projwriter::tests::batched_complexity_counters_hold ... ok
2026-07-31T04:03:09.2381391Z test relay::tests::run_honors_stop ... ok
2026-07-31T04:03:09.3235269Z test resting::tests::daemon_rest_event_arms_gate_at_rest_edge_only ... ok
2026-07-31T04:03:09.5006552Z test resting::tests::rest_edges_cascade_shells_with_divergence ... ok
2026-07-31T04:03:09.5079901Z test seedmap::tests::put_refreshes_existing ... ok
2026-07-31T04:03:09.5149339Z test seedmap::tests::put_then_take_consumes_once ... ok
2026-07-31T04:03:09.5198040Z test servicehost::tests::a_startup_fault_carries_what_the_service_said_before_it_died ... ok
2026-07-31T04:03:09.5215367Z test seedmap::tests::request_stop_barrier_holds_until_no_listener ... ok
2026-07-31T04:03:09.5284091Z test seedmap::tests::stop_op_acks_then_serve_returns ... ok
2026-07-31T04:03:09.5296073Z test servicehost::tests::adapter_dir_substitutes_as_one_argv_element_even_with_spaces ... ok
2026-07-31T04:03:09.5652136Z test registryhost::tests::erased_perch_is_advertised_offline_not_left_active ... ok
2026-07-31T04:03:09.5775364Z test servicehost::tests::an_exit_under_an_engaged_hold_stands_down_quiesced_instead_of_latching ... ok
2026-07-31T04:03:09.5847060Z test serveprobe::tests::is_serving_subnet_honors_membership_and_detach ... ok
2026-07-31T04:03:09.5870582Z test servicehost::tests::a_bind_service_defers_at_boot_and_starts_at_its_bind ... ok
2026-07-31T04:03:09.5972385Z test servicehost::tests::an_orphan_pid_running_a_different_image_is_never_killed ... ok
2026-07-31T04:03:09.5973820Z test servicehost::tests::backoff_doubles_and_saturates ... ok
2026-07-31T04:03:09.5975208Z test servicehost::tests::consecutive_fast_exits_latch_startup_fault_early ... ok
2026-07-31T04:03:09.5988920Z test servicehost::tests::empty_and_dead_orphan_records_read_apart ... ok
2026-07-31T04:03:09.6046419Z test servicehost::tests::an_orphan_whose_image_cannot_be_verified_is_reported_not_killed ... ok
2026-07-31T04:03:09.6047563Z test servicehost::tests::hold_outranks_everything ... ok
2026-07-31T04:03:09.6048970Z test servicehost::tests::only_the_three_ruled_opportunities_clear_the_latch ... ok
2026-07-31T04:03:09.6050038Z test servicehost::tests::quiesce_engages_the_hold_before_placing_the_stop_marker ... ok
2026-07-31T04:03:09.6106223Z test servicehost::tests::ensure_supervised_is_one_instance_per_option_and_refuses_an_unclear_sweep ... ok
2026-07-31T04:03:09.6107267Z test servicehost::tests::slow_crashes_latch_the_ordinary_give_up_not_startup_fault ... ok
2026-07-31T04:03:09.6108482Z test servicehost::tests::start_trigger_decides_which_opportunities_start_it ... ok
2026-07-31T04:03:09.6539568Z test servicehost::tests::a_stop_kills_the_child_and_re_reads_liveness_after_the_kill ... ok
2026-07-31T04:03:09.6971869Z test servicehost::tests::a_boot_service_starts_once_and_the_next_sweep_reads_already_running ... ok
2026-07-31T04:03:10.0379955Z test servicehost::tests::a_held_option_is_refused_by_a_clearing_sweep_and_starts_only_when_the_hold_releases ... ok
2026-07-31T04:03:10.2428286Z test servicehost::tests::a_latched_option_reports_the_captured_evidence_behind_its_latch ... ok
2026-07-31T04:03:10.2444889Z test servicehost::tests::the_service_command_resolves_its_program_through_the_install_dir_helper ... ok
2026-07-31T04:03:10.2446302Z test servicehost::tests::the_service_spawn_scrubs_the_session_identity_env ... ok
2026-07-31T04:03:10.2453341Z test servicehost::tests::the_spawn_environment_carries_the_cli_capability ... ok
2026-07-31T04:03:10.2454787Z test servicehost::tests::the_spawn_environment_carries_the_per_option_identity ... ok
2026-07-31T04:03:10.3213339Z test servicehost::tests::a_service_that_exits_on_the_stop_marker_quiesces_cooperatively ... ok
2026-07-31T04:03:10.5637053Z test servicehost::tests::a_service_that_ignores_the_stop_marker_is_force_killed_and_confirmed_dead ... ok
2026-07-31T04:03:10.5649455Z test servicehost::tests::a_soft_deregistered_adapters_service_never_starts_in_the_first_place ... ok
2026-07-31T04:03:10.5651786Z test shellchan::tests::activity_frame_parses_back_through_the_public_decoder ... ok
2026-07-31T04:03:10.5653411Z test shellchan::tests::activity_frame_shape_is_the_published_one ... ok
2026-07-31T04:03:10.5654870Z test shellchan::tests::drive_frame_shape_mirrors_sensory ... ok
2026-07-31T04:03:10.5661208Z test shellchan::tests::frames_compose_and_stamp_roundtrips ... ok
2026-07-31T04:03:10.5662709Z test servicehost::tests::a_status_read_mints_no_hold_flag_for_the_option_it_reports ... ok
2026-07-31T04:03:10.5664556Z test shellchan::tests::sensory_text_file_frames_shape ... ok
2026-07-31T04:03:10.5668007Z test shellchan::tests::vocab_check_bounds_ops_and_args ... ok
2026-07-31T04:03:10.5901851Z test shelldisc::tests::discover_across_joins_other_node_subnet_adapters ... ok
2026-07-31T04:03:10.6198012Z test servicehost::tests::a_stood_down_supervisors_latch_outlives_its_thread_and_suppresses_the_next_sweep ... ok
2026-07-31T04:03:10.6269313Z test shelldisc::tests::discovery_lists_a_dead_pid_instance_offline ... ok
2026-07-31T04:03:10.6468301Z test shelldisc::tests::shell_context_renders_sections_and_empties_to_none ... ok
2026-07-31T04:03:10.6471027Z test shellhost::tests::a_daemon_that_launches_is_the_only_launcher ... ok
2026-07-31T04:03:10.6473676Z test shellhost::tests::a_late_ack_loser_adopts_the_winner_instead_of_spawning ... ok
2026-07-31T04:03:10.6476222Z test shellhost::tests::a_post_ack_failure_never_spawns_again ... ok
2026-07-31T04:03:10.6478921Z test shellhost::tests::a_post_ack_silence_is_indeterminate_not_failure ... ok
2026-07-31T04:03:10.6482559Z test shellhost::tests::a_pre_ack_refusal_falls_back_in_process ... ok
2026-07-31T04:03:10.6769240Z test shelldisc::tests::discovery_own_plus_broadcast_gated_instantiable ... ok
2026-07-31T04:03:10.6806201Z test shellhost::tests::a_spawn_template_resolves_its_program_and_adapter_dir_against_the_install_dir ... ok
2026-07-31T04:03:10.6809646Z test shellhost::tests::an_answered_refusal_never_consults_the_arbiter ... ok
2026-07-31T04:03:10.6819278Z test shellhost::tests::an_unserved_socket_is_a_pre_ack_refusal ... ok
2026-07-31T04:03:10.6920619Z test servicehost::tests::the_startup_capture_is_reclaimed_once_the_run_proves_it_starts ... ok
2026-07-31T04:03:10.7244179Z test shellchan::tests::restamp_carries_pending_rows_across_rotation ... ok
2026-07-31T04:03:10.7343765Z test servicehost::tests::a_supervised_option_no_longer_declared_still_appears_as_undeclared ... ok
2026-07-31T04:03:10.7606227Z test shellhost::tests::gateway_typed_owner_spawns_and_owns_a_shell ... ok
2026-07-31T04:03:10.7896790Z test shellhost::tests::a_spawn_program_the_install_dir_does_not_ship_falls_through_to_path ... ok
2026-07-31T04:03:10.8654282Z test shellhost::tests::launch_fails_closed_on_bad_templates ... ok
2026-07-31T04:03:10.8656502Z test shellhost::tests::link_key_and_frame_mac_roundtrip ... ok
2026-07-31T04:03:10.8734216Z test shellhost::tests::only_a_live_recorded_pid_wins_a_launch_race ... ok
2026-07-31T04:03:10.8738514Z test shellhost::tests::only_the_relay_receipt_routes_through_the_daemon ... ok
2026-07-31T04:03:10.8777892Z test shellhost::tests::spawn_template_perch_dir_fills_as_one_argv_element ... ok
2026-07-31T04:03:10.8857362Z test shellhost::tests::spawn_template_without_perch_dir_is_unchanged ... ok
2026-07-31T04:03:10.8860046Z test shellhost::tests::the_arbiter_does_not_block_an_uncontested_fallback ... ok
2026-07-31T04:03:10.8877669Z test shellwake::tests::a_wake_template_resolves_its_program_and_adapter_dir_against_the_install_dir ... ok
2026-07-31T04:03:10.8878969Z test shellwake::tests::backoff_curve_doubles_to_the_cap ... ok
2026-07-31T04:03:10.8896916Z test shellhost::tests::close_shell_ephemeral_tears_down_and_frees_the_slot ... ok
2026-07-31T04:03:10.9186609Z test shellwake::tests::reconcile_never_adopts_a_stale_online_instance ... ok
2026-07-31T04:03:10.9635639Z test shellhost::tests::launch_parks_token_and_bind_by_token_onlines ... ok
2026-07-31T04:03:10.9657943Z test shellwake::tests::reconcile_resolves_profile_overlay ... ok
2026-07-31T04:03:10.9720042Z test shellwake::tests::resolve_wake_refuses_without_a_reachable_owner ... ok
2026-07-31T04:03:11.0047050Z test shellwake::tests::resolve_wake_leaves_a_dormant_owner_and_relaunches ... ok
2026-07-31T04:03:11.0054569Z test shellwake::tests::the_wake_catalog_shares_the_spawn_vocabulary_but_is_not_the_same_set ... ok
2026-07-31T04:03:11.0323450Z test servicehost::tests::a_supervisor_whose_declaration_is_gone_is_torn_down_by_the_next_sweep ... ok
2026-07-31T04:03:11.0433643Z test servicehost::tests::an_adapter_scoped_sweep_neither_starts_nor_stops_another_adapters_service ... ok
2026-07-31T04:03:11.0458729Z test servicehost::tests::an_unknown_op_closes_the_connection_instead_of_wedging_the_caller ... ok
2026-07-31T04:03:11.0485072Z test servicehost::tests::quiesce_raises_the_hold_before_it_can_place_any_stop_marker ... ok
2026-07-31T04:03:11.0502674Z test stderrlog::tests::roll_with_keep_one_clears_without_backup ... ok
2026-07-31T04:03:11.0505721Z test stderrlog::tests::should_roll_at_or_over_cap_only ... ok
2026-07-31T04:03:11.0513681Z test sync::tests::gate_decision_table ... ok
2026-07-31T04:03:11.0550748Z test stderrlog::tests::roll_keeps_bounded_generations_and_preserves_current ... ok
2026-07-31T04:03:11.0692628Z test servicehost::tests::the_advisory_line_is_read_bounded_and_never_dressed_up_when_absent ... ok
2026-07-31T04:03:11.0873884Z test shellwake::tests::watcher_opcode_exit_fires_resolution_once ... ok
2026-07-31T04:03:11.0876110Z test translation::tests::inject_floor_buffers_while_held_then_drains_in_order ... ok
2026-07-31T04:03:11.0882107Z test translation::tests::key_cmd_parses_each_wire_shape ... ok
2026-07-31T04:03:11.0882691Z test translation::tests::key_to_bytes_send_keys_map ... ok
2026-07-31T04:03:11.0884069Z test translation::tests::to_binary_serializes_to_wire_and_input_is_content_free ... ok
2026-07-31T04:03:11.0890410Z test transport::tests::local_socket_handshake_and_frame_round_trip ... ok
2026-07-31T04:03:11.0894434Z test transport::tests::local_socket_rejects_wrong_role ... ok
2026-07-31T04:03:11.0898844Z test tunnelhub::tests::clear_evicts_the_entry ... ok
2026-07-31T04:03:11.0900028Z test tunnelhub::tests::dead_generation_stream_is_never_surfaced ... ok
2026-07-31T04:03:11.0901084Z test tunnelhub::tests::entries_are_per_owner ... ok
2026-07-31T04:03:11.0902506Z test tunnelhub::tests::relink_overwrites_the_entry_with_a_fresh_generation ... ok
2026-07-31T04:03:11.0904418Z test tunnelhub::tests::resolve_serves_each_end_under_the_opening_token ... ok
2026-07-31T04:03:11.0906571Z test update::tests::apply_refuses_non_brain_only_plan ... ok
2026-07-31T04:03:11.0908570Z test update::tests::classify_brain_only_when_broker_hosts_new_brain ... ok
2026-07-31T04:03:11.0927572Z test update::tests::classify_broker_breaking_on_resource_abi_change ... ok
2026-07-31T04:03:11.0931554Z test update::tests::classify_broker_compatible_when_brain_below_floor ... ok
2026-07-31T04:03:11.1118537Z test update::tests::plan_verified_produces_no_plan_for_a_rejected_release ... ok
2026-07-31T04:03:11.1411425Z test update::tests::plan_verified_update_set_uses_selected_platform_spec ... ok
2026-07-31T04:03:11.1440402Z test shellhost::tests::close_shell_delivers_pre_close_then_kills_and_flips_offline ... ok
2026-07-31T04:03:11.1498871Z test update::tests::plan_verified_yields_a_plan_for_a_valid_release ... ok
2026-07-31T04:03:11.1500699Z test wan::tests::origin_user_backed_matrix ... ok
2026-07-31T04:03:11.1504297Z test shellhost::tests::close_shell_dead_child_is_prompt_and_manifestless_never_erases ... ok
2026-07-31T04:03:11.1505659Z test wan::tests::wan_ingress_empty_from_renders_origin_node_label ... ok
2026-07-31T04:03:11.1507008Z test wan::tests::wan_outcome_token_round_trips_and_unknown_is_noreply ... ok
2026-07-31T04:03:11.1509167Z test wan::tests::wan_user_msg_restamped_unless_origin_user_backed ... ok
2026-07-31T04:03:11.1633998Z test shellwake::tests::reconcile_flips_watchers_with_instance_state ... ok
2026-07-31T04:03:11.1635266Z test xfer::tests::resolve_under_confines_to_root ... ok
2026-07-31T04:03:11.1781780Z test xfer::tests::recv_state_chunks_idempotent_and_commit_replays_safely ... ok
2026-07-31T04:03:11.2849288Z test translation::tests::flagged_spawn_still_starts ... ok
2026-07-31T04:03:11.4650859Z test servicehost::tests::the_hold_outlives_the_force_killed_supervision_it_ended ... ok
2026-07-31T04:03:11.6358180Z test servicehost::tests::the_projection_reports_a_live_supervisor_with_its_declaration_and_advisory ... ok
2026-07-31T04:03:11.6370996Z test servicehost::tests::the_projection_scopes_to_one_adapter_and_keeps_deregistered_declarations ... ok
2026-07-31T04:03:11.6478356Z test servicehost::tests::the_status_op_reports_over_the_wire_and_starts_nothing ... ok
2026-07-31T04:03:11.7265313Z test shellwake::tests::watcher_crash_exits_respawn_then_give_up ... ok
2026-07-31T04:03:12.2453974Z test servicehost::tests::the_stop_marker_is_never_visible_before_the_hold_is_up ... ok
2026-07-31T04:03:14.2044070Z test servicehost::tests::a_silent_daemon_times_the_caller_out_instead_of_wedging_it ... ok
2026-07-31T04:03:14.6281122Z test shellwake::tests::resolve_wake_revives_a_suspended_owner_without_double_launch ... ok
2026-07-31T04:03:14.6282266Z test stderrlog::tests::path_under_home_and_stamp_is_legible ... ok
2026-07-31T04:03:14.7841854Z test wan::tests::no_binary_wan_arrival_spools_not_pty ... ok
2026-07-31T04:03:14.7927968Z test wan::tests::the_stamp_not_the_from_is_the_sender_subject ... ok
2026-07-31T04:03:15.4147171Z test sync::tests::reconcile_driver_structurally_excludes_live_role ... ok
2026-07-31T04:03:18.8531115Z test sync::tests::select_refs_scopes_two_tiers ... ok
2026-07-31T04:03:18.8531479Z 
2026-07-31T04:03:18.8531549Z failures:
2026-07-31T04:03:18.8531662Z 
2026-07-31T04:03:18.8531830Z ---- psyrelay::tests::notify_reaches_own_user_only stdout ----
2026-07-31T04:03:18.8532699Z 
2026-07-31T04:03:18.8533066Z thread 'psyrelay::tests::notify_reaches_own_user_only' (49524) panicked at crates\spt-daemon\src\psyrelay.rs:382:13:
2026-07-31T04:03:18.8533929Z assertion `left == right` failed
2026-07-31T04:03:18.8535023Z   left: DrainedMsg { from: "doyle-psyche", body: "<EVENT type=\"notify\" from=\"doyle-psyche\" notif_id=\"cafe:2\" subnet=\"home\">build done<br>all green</EVENT>" }
2026-07-31T04:03:18.8536095Z  right: DrainedMsg { from: "doyle-psyche", body: "<EVENT type=\"notify\" from=\"doyle-psyche\" notif_id=\"cafe:1\" subnet=\"home\">build done<br>all green</EVENT>" }
2026-07-31T04:03:18.8536453Z 
2026-07-31T04:03:18.8536465Z 
2026-07-31T04:03:18.8536550Z failures:
2026-07-31T04:03:18.8536727Z     psyrelay::tests::notify_reaches_own_user_only
2026-07-31T04:03:18.8536857Z 
2026-07-31T04:03:18.8537082Z test result: FAILED. 722 passed; 1 failed; 0 ignored; 0 measured; 0 filtered out; finished in 64.58s
2026-07-31T04:03:18.8537321Z 
2026-07-31T04:03:18.8632530Z error: test failed, to rerun pass `-p spt-daemon --lib`
2026-07-31T04:03:18.9273011Z ##[error]Process completed with exit code 1.
